program: Orca
programVersion: 5.0.2
elementType: Cl O N N C C C C C C C C C C C C C C C C C H H H H H H H H H H H H H H H H H H H
charge: 0
multiplicity: 1
keywords: wb97x-d3
keywords: def2-TZVPP
keywords: def2/J RIJCOSX
keywords: DEFGRID2
keywords: scfconv7
keywords: smallprint printgap noloewdin
keywords: NOSOSCF
formula: C17H19ClN2O
InChI: InChI=1/C17H19ClN2O/c1-17(2,14-9-4-3-5-10-14)20-16(21)19-12-13-8-6-7-11-15(13)18/h3-11,19-20H,12H2,1-2H3
40 atoms
Cl -2.318264 1.108869 -0.579191
O  0.821005 -2.711524 0.956987
N  2.159885 -1.077254 0.138634
N  0.035672 -0.593813 0.963467
C  2.297133 0.050673 -0.78286
C  2.083512 1.368472 -0.041747
C  1.3699 -0.114044 -1.992626
C  3.748896 0.030013 -1.275093
C  1.378321 2.42984 -0.599928
C  2.64161 1.540097 1.225262
C  0.978029 -1.534397 0.690945
C  -1.280897 -0.983444 1.396795
C  1.24048 3.631949 0.082988
C  2.507914 2.738068 1.905622
C  1.806945 3.792334 1.335552
C  -2.148522 -1.463843 0.261595
C  -2.66557 -0.59152 -0.690798
C  -2.431573 -2.816869 0.112416
C  -3.45127 -1.032634 -1.742161
C  -3.216295 -3.279653 -0.931797
C  -3.727798 -2.38559 -1.858745
H  1.528803 -1.096551 -2.437489
H  1.575839 0.62802 -2.764397
H  3.938765 0.878386 -1.930597
H  3.955601 -0.882094 -1.840467
H  4.45006 0.085947 -0.442513
H  2.762013 -1.857498 -0.075935
H  0.916326 2.329924 -1.57228
H  3.16937 0.715601 1.687219
H  0.207412 0.380253 0.784115
H  -1.739157 -0.123178 1.88549
H  -1.199984 -1.76889 2.14743
H  0.682896 4.44143 -0.369643
H  2.94693 2.84806 2.888591
H  1.698603 4.727656 1.868578
H  -2.011935 -3.513345 0.826294
H  -3.841911 -0.325244 -2.460503
H  -3.421707 -4.337451 -1.024441
H  -4.341484 -2.73563 -2.67787
H  0.316439 -0.039608 -1.723674
totalener: -1304.29728291 hartree
nucrepener: 1834.43064669 hartree
electener: -3138.72792960 hartree
oneelecener: -5426.40044588 hartree
twoeener: 2287.67251628 hartree
kineticenergy: 1299.88223877 hartree
xcener: -104.775578986120 hartree
chargesum: -0.0000000
charge: -0.099402 -0.438662 -0.259760 -0.236610 0.351381 -0.042378 -0.316448 -0.290659 -0.209202 -0.181947 0.359020 -0.079162 -0.112727 -0.147297 -0.114291 0.039336 0.007019 -0.083920 -0.129722 -0.130849 -0.127060 0.104999 0.086469 0.094530 0.092822 0.111164 0.132942 0.120176 0.123083 0.175719 0.128418 0.104519 0.126645 0.127381 0.127079 0.119761 0.117515 0.127279 0.126285 0.096554
qa: -0.0994 -0.4387 -0.2598 -0.2366 0.3514 -0.0424 -0.3164 -0.2907 -0.2092 -0.1819 0.3590 -0.0792 -0.1127 -0.1473 -0.1143 0.0393 0.0070 -0.0839 -0.1297 -0.1308 -0.1271 0.1050 0.0865 0.0945 0.0928 0.1112 0.1329 0.1202 0.1231 0.1757 0.1284 0.1045 0.1266 0.1274 0.1271 0.1198 0.1175 0.1273 0.1263 0.0966
va: 1.2339 2.0892 3.0226 3.0794 3.7527 3.6620 3.9665 3.9054 3.9696 4.0398 4.3877 3.9071 3.9746 3.9970 3.9578 3.5062 3.9272 3.9516 4.0168 3.9731 3.9672 1.0151 1.0061 1.0087 1.0061 1.0057 1.0435 1.0156 1.0355 1.0258 0.9986 1.0215 1.0015 1.0018 0.9995 1.0218 1.0121 0.9998 0.9987 1.0157
dispcorr: -0.022835918 hartree
energy: -1304.320118827406
dipole: 14.72255 -14.60922 0.11334 -0.62875 1.44820 0.81946 -4.24474 3.59874 -0.64600
magnitude: 1.04960 au
magnitude: 2.66788 debye
