program: Orca
programVersion: 5.0.2
elementType: Br O N C C C C C C C C C C C C C C C H H H H H H H H H H H H H H H H H H H H H H
charge: 0
multiplicity: 1
keywords: wb97x-d3
keywords: def2-TZVPP
keywords: def2/J RIJCOSX
keywords: DEFGRID2
keywords: scfconv7
keywords: smallprint printgap noloewdin
keywords: NOSOSCF
formula: C15H22BrNO
InChI: InChI=1/C15H22BrNO/c1-14(2,3)12(16)13(18)17-15(4,5)11-9-7-6-8-10-11/h6-10,12,17H,1-5H3
40 atoms
Br 2.597952 1.915991 0.725826
O  -0.273232 1.3091 -0.806217
N  -0.415817 -0.059427 0.985806
C  2.352162 -0.201116 -1.309855
C  -1.856461 0.055594 1.222982
C  1.750753 0.2772 0.022804
C  1.509041 -1.405083 -1.755405
C  3.7811 -0.685883 -1.057851
C  2.372807 0.84346 -2.422753
C  0.254109 0.568391 0.013166
C  -2.625957 -0.395335 -0.015155
C  -2.206787 1.473542 1.672637
C  -2.18083 -0.907518 2.368131
C  -2.266686 -1.584322 -0.651599
C  -3.725678 0.303456 -0.501002
C  -2.983799 -2.058605 -1.738886
C  -4.450077 -0.171884 -1.588934
C  -4.084043 -1.354235 -2.212406
H  1.97014 -0.48749 0.770983
H  0.099408 -0.661497 1.610046
H  1.966725 -1.866449 -2.632268
H  0.49266 -1.122533 -2.033474
H  1.45058 -2.169813 -0.977431
H  4.447194 0.122772 -0.753593
H  3.810441 -1.455405 -0.283385
H  4.191952 -1.119528 -1.970868
H  2.979685 1.710199 -2.159052
H  2.816613 0.398741 -3.315426
H  1.379517 1.194953 -2.691468
H  -2.066824 2.215437 0.888854
H  -3.243559 1.527178 2.004038
H  -1.581037 1.751325 2.520442
H  -1.651002 -0.618408 3.277724
H  -1.904063 -1.933268 2.121682
H  -3.248602 -0.888431 2.580426
H  -1.414651 -2.151833 -0.297398
H  -4.035842 1.230353 -0.038196
H  -2.684081 -2.983082 -2.215516
H  -5.302862 0.38983 -1.947784
H  -4.647302 -1.724797 -3.058948
elementType: Br O N C H
totalener: -3289.15035411 hartree
nucrepener: 1807.45350880 hartree
electener: -5096.60386291 hartree
oneelecener: -8147.25313285 hartree
twoeener: 3050.64926994 hartree
cpcmener: -0.03662247 hartree
kineticenergy: 3282.06657599 hartree
xcener: -141.931675820423 hartree
chargesum: -0.0000000
charge: -0.140666 -0.543625 -0.148736 0.203880 0.410099 -0.017607 -0.367715 -0.328118 -0.319255 0.260636 -0.017962 -0.349790 -0.313565 -0.292729 -0.182639 -0.166016 -0.155482 -0.171239 0.135465 0.164339 0.108780 0.098992 0.114692 0.094511 0.101300 0.101205 0.091178 0.101826 0.097061 0.109424 0.105234 0.105191 0.115235 0.114594 0.105323 0.150003 0.146540 0.159235 0.159053 0.161348
qa: -0.1407 -0.5436 -0.1487 0.2039 0.4101 -0.0176 -0.3677 -0.3281 -0.3193 0.2606 -0.0180 -0.3498 -0.3136 -0.2927 -0.1826 -0.1660 -0.1555 -0.1712 0.1355 0.1643 0.1088 0.0990 0.1147 0.0945 0.1013 0.1012 0.0912 0.1018 0.0971 0.1094 0.1052 0.1052 0.1152 0.1146 0.1053 0.1500 0.1465 0.1592 0.1591 0.1613
va: 1.1376 1.9570 3.2378 3.7733 3.6491 3.9187 3.9403 3.9181 3.9261 4.2191 3.5262 3.9262 3.9107 4.0028 3.9274 3.9211 3.9143 3.8985 1.0168 1.0114 1.0068 1.0077 1.0023 1.0123 1.0047 1.0059 1.0116 1.0036 1.0227 1.0137 1.0011 1.0117 1.0017 0.9991 1.0049 1.0052 1.0031 0.9912 0.9921 0.9888
dispcorr: -0.022190077 hartree
energy: -3289.172544187608
dipole: -30.60178 30.55944 -0.04234 -29.57692 27.29838 -2.27854 -13.16428 14.53726 1.37299
magnitude: 2.66057 au
magnitude: 6.76263 debye
