program: Orca
programVersion: 5.0.2
elementType: Br O N C C C C C C C C C C C C C C C H H H H H H H H H H H H H H H H H H H H H H
charge: 0
multiplicity: 1
keywords: wb97x-d3
keywords: def2-TZVPP
keywords: def2/J RIJCOSX
keywords: DEFGRID2
keywords: scfconv7
keywords: smallprint printgap noloewdin
keywords: NOSOSCF
formula: C15H22BrNO
InChI: InChI=1/C15H22BrNO/c1-14(2,3)12(16)13(18)17-15(4,5)11-9-7-6-8-10-11/h6-10,12,17H,1-5H3
40 atoms
Br 1.997063 -1.744778 0.15023
O  -0.363992 0.731644 -1.611438
N  -0.208931 0.51766 0.630068
C  2.794921 1.035557 -0.442313
C  -1.541996 1.021011 0.970149
C  1.723155 -0.023899 -0.784944
C  2.883754 1.387313 1.040751
C  2.43445 2.302569 -1.23187
C  4.158251 0.53977 -0.926171
C  0.275792 0.433728 -0.613561
C  -2.603901 0.217055 0.225266
C  -1.61201 2.524042 0.697741
C  -1.721345 0.790171 2.473016
C  -3.696769 0.820775 -0.386371
C  -2.51238 -1.174371 0.186998
C  -4.668807 0.058983 -1.024496
C  -3.47781 -1.936497 -0.451389
C  -4.563188 -1.322086 -1.063302
H  1.829388 -0.27565 -1.841323
H  0.382245 0.253556 1.403039
H  3.685498 2.112948 1.188271
H  3.118899 0.523231 1.663918
H  1.970979 1.846997 1.421266
H  2.317458 2.101646 -2.298386
H  1.517366 2.772151 -0.872291
H  3.233783 3.037064 -1.121217
H  4.899431 1.333409 -0.817017
H  4.517088 -0.318115 -0.356657
H  4.131584 0.256391 -1.980585
H  -1.543747 2.764116 -0.362252
H  -2.538953 2.951017 1.081008
H  -0.790521 3.023296 1.212859
H  -1.633046 -0.265712 2.733608
H  -2.70555 1.131934 2.791022
H  -0.973202 1.346484 3.042699
H  -3.805516 1.896949 -0.382026
H  -1.670818 -1.675259 0.650653
H  -5.507435 0.553802 -1.49803
H  -3.379499 -3.01458 -0.474601
H  -5.315547 -1.915435 -1.56707
elementType: Br O N C H
totalener: -3289.15938361 hartree
nucrepener: 1822.87366058 hartree
electener: -5112.03304419 hartree
oneelecener: -8177.58495680 hartree
twoeener: 3065.55191260 hartree
cpcmener: -0.02539259 hartree
kineticenergy: 3282.05385196 hartree
xcener: -141.927982280930 hartree
chargesum: -0.0000000
charge: -0.145550 -0.490740 -0.198859 0.223366 0.414478 -0.050645 -0.356095 -0.346976 -0.324486 0.253133 -0.023974 -0.362135 -0.312280 -0.177901 -0.229455 -0.156789 -0.182780 -0.159685 0.144016 0.171240 0.106351 0.103899 0.094835 0.110995 0.098525 0.103005 0.100453 0.097954 0.103036 0.113145 0.107902 0.104016 0.113988 0.105430 0.111861 0.143338 0.129322 0.153701 0.153702 0.156659
qa: -0.1455 -0.4907 -0.1989 0.2234 0.4145 -0.0506 -0.3561 -0.3470 -0.3245 0.2531 -0.0240 -0.3621 -0.3123 -0.1779 -0.2295 -0.1568 -0.1828 -0.1597 0.1440 0.1712 0.1064 0.1039 0.0948 0.1110 0.0985 0.1030 0.1005 0.0980 0.1030 0.1131 0.1079 0.1040 0.1140 0.1054 0.1119 0.1433 0.1293 0.1537 0.1537 0.1567
va: 1.1465 2.0131 3.1858 3.7254 3.6420 3.9413 3.9306 3.9476 3.9243 4.2319 3.5599 3.9387 3.9099 3.9398 3.9920 3.9307 3.9502 3.8951 1.0215 1.0098 1.0070 1.0098 1.0105 1.0076 1.0031 1.0048 1.0054 1.0105 1.0035 1.0118 1.0027 1.0070 1.0006 1.0057 1.0010 1.0035 1.0188 0.9939 0.9926 0.9902
dispcorr: -0.022606656 hartree
energy: -3289.181990263835
dipole: -17.16837 17.83621 0.66784 36.10761 -35.22994 0.87766 2.60781 -0.99708 1.61074
magnitude: 1.95212 au
magnitude: 4.96190 debye
