program: Orca
programVersion: 5.0.2
elementType: Br O N C C C C C C C C C C C C C C C H H H H H H H H H H H H H H H H H H H H H H
charge: 0
multiplicity: 1
keywords: wb97x-d3
keywords: def2-TZVPP
keywords: def2/J RIJCOSX
keywords: DEFGRID2
keywords: scfconv7
keywords: smallprint printgap noloewdin
keywords: NOSOSCF
formula: C15H22BrNO
InChI: InChI=1/C15H22BrNO/c1-14(2,3)12(16)13(18)17-15(4,5)11-9-7-6-8-10-11/h6-10,12,17H,1-5H3
40 atoms
Br 2.041724 -1.680981 -0.034549
O  1.115174 1.221086 1.723026
N  -0.483674 0.505709 0.283683
C  3.136212 1.020536 -0.455155
C  -1.692597 0.791737 1.065353
C  1.808826 0.250251 -0.378811
C  2.77526 2.495849 -0.690584
C  3.925335 0.527711 -1.67249
C  4.013133 0.896686 0.790006
C  0.792049 0.719335 0.668043
C  -2.828883 0.076778 0.339097
C  -1.892884 2.305021 1.146626
C  -1.604739 0.211886 2.484727
C  -4.00466 0.716775 -0.032448
C  -2.704335 -1.285979 0.060264
C  -5.02887 0.0192 -0.660277
C  -3.722106 -1.982681 -0.56883
C  -4.892861 -1.331513 -0.930921
H  1.352197 0.294827 -1.372835
H  -0.636753 0.117678 -0.631819
H  3.684673 3.069292 -0.875935
H  2.276931 2.940835 0.168608
H  2.132273 2.621017 -1.565469
H  4.246597 -0.508039 -1.56574
H  3.342281 0.605872 -2.593228
H  4.821785 1.135816 -1.801556
H  3.514704 1.263593 1.682336
H  4.316997 -0.134741 0.968627
H  4.923956 1.480499 0.643649
H  -1.030555 2.761644 1.628508
H  -2.004955 2.749463 0.157103
H  -2.771215 2.558174 1.74124
H  -0.862941 0.7306 3.085879
H  -1.348063 -0.846771 2.465476
H  -2.57577 0.310299 2.970384
H  -4.138511 1.771692 0.162447
H  -1.800033 -1.813695 0.341384
H  -5.9355 0.539758 -0.939775
H  -3.601177 -3.038378 -0.77348
H  -5.690528 -1.874133 -1.420637
totalener: -3289.13546392 hartree
nucrepener: 1788.42031551 hartree
electener: -5077.55577943 hartree
oneelecener: -8108.12804064 hartree
twoeener: 3030.57226120 hartree
kineticenergy: 3282.09368617 hartree
xcener: -141.931761482950 hartree
chargesum: 0.0000000
charge: -0.113947 -0.420558 -0.203544 0.174650 0.425726 -0.100507 -0.330769 -0.295490 -0.298392 0.289189 -0.073771 -0.359251 -0.311475 -0.139643 -0.231186 -0.123951 -0.152392 -0.115326 0.122492 0.137563 0.090638 0.112210 0.091490 0.100189 0.083414 0.089283 0.120683 0.088592 0.084299 0.116868 0.097418 0.089697 0.124222 0.095986 0.100525 0.124701 0.130597 0.124749 0.128020 0.127003
qa: -0.1139 -0.4206 -0.2035 0.1747 0.4257 -0.1005 -0.3308 -0.2955 -0.2984 0.2892 -0.0738 -0.3593 -0.3115 -0.1396 -0.2312 -0.1240 -0.1524 -0.1153 0.1225 0.1376 0.0906 0.1122 0.0915 0.1002 0.0834 0.0893 0.1207 0.0886 0.0843 0.1169 0.0974 0.0897 0.1242 0.0960 0.1005 0.1247 0.1306 0.1247 0.1280 0.1270
va: 1.1603 2.0785 3.2198 3.8391 3.6272 3.9935 3.9218 3.9175 3.9093 4.1570 3.6493 3.9441 3.9193 3.9348 4.0365 3.9964 4.0153 3.9568 1.0066 1.0386 1.0083 1.0173 1.0054 1.0164 1.0087 1.0089 1.0233 1.0136 1.0042 1.0224 1.0070 1.0028 1.0199 1.0055 1.0019 1.0073 1.0213 1.0033 1.0013 0.9995
dispcorr: -0.021035546 hartree
energy: -3289.156499468682
dipole: -18.07553 17.25404 -0.82148 32.26140 -32.01147 0.24993 1.02105 -1.97545 -0.95440
magnitude: 1.28381 au
magnitude: 3.26319 debye
