program: Orca
programVersion: 5.0.2
elementType: Br O N C C C C C C C C C C C C C C C H H H H H H H H H H H H H H H H H H H H H H
charge: 0
multiplicity: 1
keywords: wb97x-d3
keywords: def2-TZVPP
keywords: def2/J RIJCOSX
keywords: DEFGRID2
keywords: scfconv7
keywords: smallprint printgap noloewdin
keywords: NOSOSCF
formula: C15H22BrNO
InChI: InChI=1/C15H22BrNO/c1-14(2,3)12(16)13(18)17-15(4,5)11-9-7-6-8-10-11/h6-10,12,17H,1-5H3
40 atoms
Br 1.910018 -1.678178 0.197802
O  -0.319957 1.022906 -1.534297
N  -0.225903 0.59195 0.681321
C  2.820602 1.03793 -0.48192
C  -1.578638 1.036623 1.014864
C  1.684342 0.031753 -0.77248
C  2.900655 1.457969 0.984704
C  2.558074 2.284418 -1.341496
C  4.159479 0.435416 -0.915002
C  0.269535 0.581112 -0.572366
C  -2.606005 0.222531 0.232008
C  -1.700062 2.544879 0.791522
C  -1.773911 0.748821 2.507265
C  -3.717154 0.803032 -0.364509
C  -2.466727 -1.161799 0.157138
C  -4.66604 0.025122 -1.014275
C  -3.410246 -1.940987 -0.489855
C  -4.518714 -1.349611 -1.078686
H  1.737563 -0.250785 -1.824994
H  0.304373 0.146542 1.411601
H  3.722465 2.163058 1.117731
H  3.09223 0.612728 1.646927
H  1.9911 1.958873 1.317534
H  2.442063 2.034185 -2.396571
H  1.665368 2.826732 -1.03271
H  3.404232 2.967187 -1.252032
H  4.945622 1.188163 -0.838203
H  4.456861 -0.410791 -0.296781
H  4.12857 0.098819 -1.953101
H  -1.628073 2.808257 -0.261251
H  -2.645473 2.924378 1.179962
H  -0.900592 3.055186 1.329639
H  -1.658082 -0.312691 2.731938
H  -2.777092 1.03796 2.816029
H  -1.059335 1.3124 3.111905
H  -3.853384 1.875294 -0.343656
H  -1.599429 -1.643385 0.59323
H  -5.519587 0.501915 -1.478354
H  -3.276098 -3.013744 -0.538782
H  -5.256384 -1.955918 -1.587605
totalener: -3289.13705722 hartree
nucrepener: 1825.10935392 hartree
electener: -5114.24641114 hartree
oneelecener: -8181.54518414 hartree
twoeener: 3067.29877301 hartree
kineticenergy: 3282.09695127 hartree
xcener: -141.931346020330 hartree
chargesum: -0.0000000
charge: -0.139109 -0.371170 -0.224549 0.173496 0.320993 -0.047398 -0.342798 -0.304640 -0.293966 0.224259 0.061581 -0.338624 -0.297898 -0.143236 -0.217856 -0.124268 -0.157705 -0.121770 0.144405 0.146482 0.096770 0.102345 0.083403 0.104433 0.097722 0.088592 0.088754 0.101171 0.094525 0.129311 0.088934 0.088815 0.106205 0.099231 0.104045 0.111166 0.104547 0.119117 0.121838 0.122849
qa: -0.1391 -0.3712 -0.2245 0.1735 0.3210 -0.0474 -0.3428 -0.3046 -0.2940 0.2243 0.0616 -0.3386 -0.2979 -0.1432 -0.2179 -0.1243 -0.1577 -0.1218 0.1444 0.1465 0.0968 0.1023 0.0834 0.1044 0.0977 0.0886 0.0888 0.1012 0.0945 0.1293 0.0889 0.0888 0.1062 0.0992 0.1040 0.1112 0.1045 0.1191 0.1218 0.1228
va: 1.1600 2.1381 3.1221 3.8072 3.8271 3.9452 3.9285 3.9539 3.9199 4.2420 3.5468 3.9053 3.9088 4.0100 4.0626 4.0030 4.0325 3.9586 1.0184 1.0385 1.0127 1.0126 1.0174 1.0114 1.0090 1.0049 1.0078 1.0123 1.0073 1.0133 1.0056 1.0135 1.0026 1.0106 1.0030 1.0115 1.0231 1.0035 1.0013 0.9998
dispcorr: -0.022409676 hartree
energy: -3289.159466897537
dipole: -16.18028 16.53400 0.35372 34.59102 -34.18238 0.40864 1.81522 -0.94421 0.87101
magnitude: 1.02507 au
magnitude: 2.60551 debye
