program: Orca
programVersion: 5.0.2
elementType: S S S P O O O O N C C C C C C C C C C C C C C H H H H H H H H H H H H H H H H H H H H H H H H
charge: 0
multiplicity: 1
keywords: wb97x-d3
keywords: def2-TZVPP
keywords: def2/J RIJCOSX
keywords: DEFGRID2
keywords: scfconv7
keywords: smallprint printgap noloewdin
keywords: NOSOSCF
formula: C14H24NO4PS3
InChI: InChI=1/C14H24NO4PS3/c1-12(2)18-20(21,19-13(3)4)22-11-10-15-23(16,17)14-8-6-5-7-9-14/h5-9,12-13,15H,10-11H2,1-4H3
47 atoms
S  -3.267804 0.39126 0.899967
S  0.428135 1.608366 -0.162306
S  3.196415 0.585856 1.562428
P  1.781433 0.111393 0.336309
O  2.223384 -0.372755 -1.123484
O  0.820628 -1.071664 0.812595
O  -4.61898 0.903459 0.714798
O  -3.055033 -0.812907 1.690223
N  -2.43426 1.598712 1.618599
C  -1.112883 1.445955 2.20596
C  -0.024788 2.225067 1.492242
C  3.489718 -0.033352 -1.746482
C  1.280169 -2.23352 1.554883
C  -2.57787 0.11968 -0.709672
C  3.405205 1.340327 -2.375046
C  3.778026 -1.127791 -2.748179
C  2.262463 -3.052359 0.743613
C  0.034803 -3.013626 1.909503
C  -1.859448 -1.034354 -0.972478
C  -2.727959 1.117024 -1.666082
C  -1.252356 -1.179184 -2.21229
C  -2.124707 0.956567 -2.900909
C  -1.380041 -0.185896 -3.171103
H  -0.860695 0.390507 2.276857
H  -1.153596 1.81675 3.23212
H  -0.333098 3.260684 1.338679
H  0.873264 2.253125 2.111549
H  4.260945 -0.037132 -0.971856
H  1.76438 -1.873457 2.466348
H  -2.670444 2.524337 1.276998
H  2.609983 1.385519 -3.120772
H  4.347524 1.572595 -2.871522
H  3.226994 2.116693 -1.630102
H  3.027053 -1.154869 -3.539324
H  4.747685 -0.947867 -3.211905
H  3.815547 -2.106107 -2.268125
H  3.195723 -2.518193 0.562497
H  1.834506 -3.350662 -0.214357
H  2.513428 -3.958379 1.295496
H  -0.454782 -3.405471 1.016178
H  0.303496 -3.85886 2.542484
H  -0.680727 -2.400337 2.457163
H  -1.764778 -1.814476 -0.230991
H  -3.29529 2.01508 -1.456772
H  -0.682302 -2.07328 -2.426346
H  -2.231754 1.726497 -3.653012
H  -0.903966 -0.302157 -4.135816
elementType: S P O N C H
totalener: -2439.77542017 hartree
nucrepener: 3016.65471352 hartree
electener: -5456.43013369 hartree
oneelecener: -9361.30864068 hartree
twoeener: 3904.87850699 hartree
cpcmener: -0.04505221 hartree
kineticenergy: 2432.73299301 hartree
xcener: -161.474678977920 hartree
chargesum: -0.0000000
charge: 0.880557 -0.163250 -0.459852 0.630661 -0.360844 -0.331337 -0.556272 -0.543774 -0.221199 -0.027262 -0.093952 0.145258 0.145520 -0.016073 -0.250571 -0.249983 -0.254300 -0.294788 -0.114725 -0.134942 -0.205025 -0.154430 -0.114226 0.089602 0.113439 0.133986 0.113372 0.073482 0.078258 0.180457 0.091985 0.104654 0.080813 0.090938 0.094782 0.098228 0.084230 0.094077 0.103649 0.094022 0.111584 0.102488 0.177721 0.141282 0.163178 0.164487 0.164096
qa: 0.8806 -0.1633 -0.4599 0.6307 -0.3608 -0.3313 -0.5563 -0.5438 -0.2212 -0.0273 -0.0940 0.1453 0.1455 -0.0161 -0.2506 -0.2500 -0.2543 -0.2948 -0.1147 -0.1349 -0.2050 -0.1544 -0.1142 0.0896 0.1134 0.1340 0.1134 0.0735 0.0783 0.1805 0.0920 0.1047 0.0808 0.0909 0.0948 0.0982 0.0842 0.0941 0.1036 0.0940 0.1116 0.1025 0.1777 0.1413 0.1632 0.1645 0.1641
va: 5.8517 2.3075 2.0033 5.4244 2.0723 2.0964 1.9232 1.9357 3.0501 3.9306 3.8639 3.8161 3.8051 3.6351 3.9030 3.9292 3.8886 3.9396 3.8521 3.9442 3.9173 3.9043 3.8648 1.0245 1.0017 1.0025 1.0461 1.0266 1.0229 1.0167 1.0063 1.0101 1.0236 1.0053 1.0069 1.0047 1.0207 1.0074 1.0105 0.9987 1.0092 1.0080 0.9849 1.0100 0.9900 0.9862 0.9859
dispcorr: -0.032724454 hartree
energy: -2439.808144619141
dipole: 18.78089 -16.45211 2.32878 -11.36592 11.99772 0.63180 -9.12424 7.45985 -1.66439
magnitude: 2.93131 au
magnitude: 7.45080 debye
