program: Orca
programVersion: 5.0.2
elementType: S S S P O O O O N C C C C C C C C C C C C C C H H H H H H H H H H H H H H H H H H H H H H H H
charge: 0
multiplicity: 1
keywords: wb97x-d3
keywords: def2-TZVPP
keywords: def2/J RIJCOSX
keywords: DEFGRID2
keywords: scfconv7
keywords: smallprint printgap noloewdin
keywords: NOSOSCF
formula: C14H24NO4PS3
InChI: InChI=1/C14H24NO4PS3/c1-12(2)18-20(21,19-13(3)4)22-11-10-15-23(16,17)14-8-6-5-7-9-14/h5-9,12-13,15H,10-11H2,1-4H3
47 atoms
S  -1.663425 2.334234 -1.270636
S  -0.409332 -0.020168 1.686458
S  2.959006 -0.393383 2.096797
P  1.434749 -0.601155 0.930524
O  1.511822 0.198253 -0.45097
O  1.099055 -2.084853 0.440891
O  -0.961056 2.45507 -2.541016
O  -2.808457 3.189882 -0.990894
N  -0.544966 2.638313 -0.114538
C  -0.898496 2.690942 1.296654
C  -0.105469 1.720233 2.150459
C  2.710607 0.253203 -1.277296
C  1.226814 -3.273025 1.26538
C  -2.193537 0.656061 -1.096382
C  2.813743 1.66524 -1.80508
C  2.601716 -0.782825 -2.37397
C  1.872976 -4.336551 0.407655
C  -0.142862 -3.672124 1.768748
C  -1.450833 -0.348906 -1.701555
C  -3.282438 0.365398 -0.286268
C  -1.792853 -1.669906 -1.465479
C  -3.617733 -0.961643 -0.064452
C  -2.870047 -1.976679 -0.643912
H  -1.965753 2.51428 1.428264
H  -0.706656 3.695321 1.679878
H  0.964253 1.931031 2.107211
H  -0.408995 1.836938 3.189976
H  3.576447 0.036598 -0.645668
H  1.879812 -3.040064 2.111207
H  0.36734 2.250576 -0.331469
H  1.951403 1.922844 -2.422235
H  3.707931 1.759225 -2.421385
H  2.891361 2.388349 -0.992642
H  3.485883 -0.732578 -3.009796
H  2.542587 -1.794537 -1.972816
H  1.726846 -0.604235 -3.001462
H  2.856518 -4.022287 0.057957
H  1.254717 -4.578355 -0.458381
H  2.001845 -5.247222 0.992315
H  -0.824485 -3.881472 0.942821
H  -0.058282 -4.575689 2.372713
H  -0.585031 -2.898435 2.39717
H  -0.616082 -0.117443 -2.348581
H  -3.865457 1.151587 0.173351
H  -1.218516 -2.460939 -1.928492
H  -4.464364 -1.200283 0.56479
H  -3.13129 -3.010764 -0.462057
elementType: S P O N C H
totalener: -2439.77568625 hartree
nucrepener: 3049.58028706 hartree
electener: -5489.35597331 hartree
oneelecener: -9426.29562849 hartree
twoeener: 3936.93965518 hartree
cpcmener: -0.04250728 hartree
kineticenergy: 2432.74027356 hartree
xcener: -161.475164704984 hartree
chargesum: -0.0000000
charge: 0.887201 -0.181752 -0.461012 0.653870 -0.343840 -0.357419 -0.558784 -0.545809 -0.247720 -0.067805 -0.053182 0.141430 0.150564 -0.015449 -0.261715 -0.265726 -0.255536 -0.270082 -0.118908 -0.122250 -0.209168 -0.147729 -0.121375 0.115856 0.114765 0.103444 0.126262 0.070505 0.068430 0.197278 0.085289 0.111546 0.098538 0.105745 0.091102 0.093684 0.094254 0.093936 0.100682 0.088877 0.109781 0.092389 0.163073 0.151319 0.163659 0.164290 0.167490
qa: 0.8872 -0.1818 -0.4610 0.6539 -0.3438 -0.3574 -0.5588 -0.5458 -0.2477 -0.0678 -0.0532 0.1414 0.1506 -0.0154 -0.2617 -0.2657 -0.2555 -0.2701 -0.1189 -0.1222 -0.2092 -0.1477 -0.1214 0.1159 0.1148 0.1034 0.1263 0.0705 0.0684 0.1973 0.0853 0.1115 0.0985 0.1057 0.0911 0.0937 0.0943 0.0939 0.1007 0.0889 0.1098 0.0924 0.1631 0.1513 0.1637 0.1643 0.1675
va: 5.8345 2.2966 2.0115 5.4326 2.0625 2.0862 1.9221 1.9304 3.0036 3.9628 3.8578 3.8246 3.8268 3.6391 3.8924 3.9357 3.9136 3.9157 3.8630 3.9030 3.9036 3.9118 3.8503 1.0051 1.0051 1.0381 1.0131 1.0305 1.0303 1.0316 1.0170 1.0076 1.0073 1.0083 1.0113 1.0013 1.0096 1.0045 1.0076 1.0054 1.0110 1.0165 0.9934 1.0116 0.9913 0.9862 0.9831
dispcorr: -0.034215257 hartree
energy: -2439.809901506254
dipole: 9.51997 -8.97714 0.54283 -17.24623 14.63130 -2.61493 -2.98413 4.37239 1.38826
magnitude: 3.00995 au
magnitude: 7.65068 debye
