program: Orca
programVersion: 5.0.2
elementType: S S S P O O O O N C C C C C C C C C C C C C C H H H H H H H H H H H H H H H H H H H H H H H H
charge: 0
multiplicity: 1
keywords: wb97x-d3
keywords: def2-TZVPP
keywords: def2/J RIJCOSX
keywords: DEFGRID2
keywords: scfconv7
keywords: smallprint printgap noloewdin
keywords: NOSOSCF
formula: C14H24NO4PS3
InChI: InChI=1/C14H24NO4PS3/c1-12(2)18-20(21,19-13(3)4)22-11-10-15-23(16,17)14-8-6-5-7-9-14/h5-9,12-13,15H,10-11H2,1-4H3
47 atoms
S  -1.559899 2.746827 0.375407
S  -0.530804 -0.806416 -1.332933
S  0.613425 -2.75181 1.076735
P  1.058917 -1.291661 -0.097286
O  1.399636 0.124049 0.56668
O  2.358949 -1.50637 -1.0100
O  -2.430846 3.645355 -0.364759
O  -0.944659 3.180355 1.62011
N  -0.324774 2.346217 -0.622498
C  -0.567932 1.912114 -1.99005
C  0.111925 0.596447 -2.322526
C  2.552069 0.302567 1.441884
C  2.795242 -2.800293 -1.496401
C  -2.468737 1.262526 0.699971
C  2.039388 0.834565 2.760057
C  3.5210 1.239772 0.757804
C  4.240672 -2.633676 -1.907467
C  1.911029 -3.270255 -2.631926
C  -3.569566 0.948141 -0.084376
C  -2.00697 0.395345 1.681364
C  -4.211353 -0.264846 0.11562
C  -2.659621 -0.810083 1.872635
C  -3.755201 -1.14328 1.087325
H  -0.185072 2.662735 -2.685946
H  -1.638149 1.831329 -2.186826
H  -0.079641 0.355018 -3.367962
H  1.193906 0.669033 -2.2138
H  3.030864 -0.667559 1.605281
H  2.733591 -3.509574 -0.666361
H  0.444423 1.888715 -0.141991
H  2.875924 0.997761 3.44002
H  1.358071 0.128975 3.236175
H  1.522922 1.786838 2.629106
H  3.066751 2.215623 0.575829
H  4.394398 1.392082 1.392349
H  3.869848 0.836422 -0.193175
H  4.854143 -2.281111 -1.077454
H  4.344179 -1.93412 -2.738977
H  4.640232 -3.595988 -2.227995
H  2.293093 -4.213177 -3.024224
H  0.885388 -3.446808 -2.306388
H  1.894217 -2.54756 -3.449564
H  -3.931409 1.633235 -0.839367
H  -1.153092 0.649992 2.295137
H  -5.070011 -0.5205 -0.490935
H  -2.30705 -1.492702 2.633462
H  -4.257856 -2.089927 1.237746
elementType: S P O N C H
totalener: -2439.78613362 hartree
nucrepener: 3015.63479161 hartree
electener: -5455.42092523 hartree
oneelecener: -9358.58700198 hartree
twoeener: 3903.16607675 hartree
cpcmener: -0.03504390 hartree
kineticenergy: 2432.71696409 hartree
xcener: -161.469934202961 hartree
chargesum: -0.0000000
charge: 0.878573 -0.162698 -0.447800 0.655761 -0.362322 -0.345534 -0.531213 -0.541698 -0.254297 -0.061584 -0.081920 0.150288 0.143614 -0.028411 -0.270500 -0.264944 -0.254883 -0.259462 -0.115458 -0.111801 -0.163162 -0.188520 -0.111232 0.113766 0.111236 0.127877 0.108125 0.078893 0.071058 0.191734 0.108047 0.092252 0.088993 0.092783 0.104767 0.090899 0.096702 0.090240 0.093871 0.103931 0.085591 0.093283 0.152144 0.163036 0.161319 0.148157 0.160495
qa: 0.8786 -0.1627 -0.4478 0.6558 -0.3623 -0.3455 -0.5312 -0.5417 -0.2543 -0.0616 -0.0819 0.1503 0.1436 -0.0284 -0.2705 -0.2649 -0.2549 -0.2595 -0.1155 -0.1118 -0.1632 -0.1885 -0.1112 0.1138 0.1112 0.1279 0.1081 0.0789 0.0711 0.1917 0.1080 0.0923 0.0890 0.0928 0.1048 0.0909 0.0967 0.0902 0.0939 0.1039 0.0856 0.0933 0.1521 0.1630 0.1613 0.1482 0.1605
va: 5.8588 2.2865 2.0176 5.4150 2.0533 2.1025 1.9532 1.9436 2.9877 3.9673 3.8792 3.8212 3.8371 3.6732 3.9325 3.9338 3.9290 3.8939 3.9073 3.8590 3.9354 3.9486 3.8925 1.0051 1.0068 1.0131 1.0287 1.0181 1.0286 1.0489 1.0096 1.0127 1.0111 1.0040 1.0063 1.0140 1.0073 1.0056 1.0069 1.0108 1.0214 1.0058 1.0123 0.9867 0.9880 1.0052 0.9866
dispcorr: -0.033154648 hartree
energy: -2439.819288268866
dipole: 23.04618 -20.97233 2.07385 -7.59288 5.59212 -2.00076 -7.74063 5.60824 -2.13239
magnitude: 3.58483 au
magnitude: 9.11190 debye
