program: Orca
programVersion: 5.0.2
elementType: S S S P O O O O N C C C C C C C C C C C C C C H H H H H H H H H H H H H H H H H H H H H H H H
charge: 0
multiplicity: 1
keywords: wb97x-d3
keywords: def2-TZVPP
keywords: def2/J RIJCOSX
keywords: DEFGRID2
keywords: scfconv7
keywords: smallprint printgap noloewdin
keywords: NOSOSCF
formula: C14H24NO4PS3
InChI: InChI=1/C14H24NO4PS3/c1-12(2)18-20(21,19-13(3)4)22-11-10-15-23(16,17)14-8-6-5-7-9-14/h5-9,12-13,15H,10-11H2,1-4H3
47 atoms
S  -1.848212 2.552041 0.715168
S  1.198155 0.466517 -2.289293
S  -0.241715 -1.93817 -0.336317
P  1.28396 -0.811621 -0.640845
O  1.698506 0.164934 0.558404
O  2.679862 -1.5318 -0.949064
O  -2.927051 3.24306 0.039241
O  -1.232171 3.064208 1.921846
N  -0.63428 2.391795 -0.377101
C  -0.834997 2.296252 -1.801316
C  -0.565624 0.916547 -2.380631
C  1.570115 -0.237376 1.946488
C  2.759258 -2.6115 -1.905855
C  -2.430591 0.910895 1.081216
C  1.767712 1.015285 2.772673
C  2.565243 -1.327778 2.294897
C  2.920374 -3.913663 -1.149545
C  3.916039 -2.306034 -2.83278
C  -3.27897 0.277724 0.183678
C  -2.047705 0.291172 2.260842
C  -3.714597 -1.007653 0.455201
C  -2.497749 -0.992973 2.52711
C  -3.322768 -1.64436 1.624219
H  -0.198949 3.032866 -2.297402
H  -1.861717 2.588084 -2.02329
H  -1.150821 0.136085 -1.890363
H  -0.816528 0.90541 -3.441614
H  0.553889 -0.617368 2.087011
H  1.831041 -2.647849 -2.486604
H  0.271678 2.148495 0.00026
H  2.771105 1.421893 2.641712
H  1.640963 0.777263 3.829098
H  1.043258 1.790098 2.52255
H  2.362908 -2.252454 1.755635
H  3.58706 -1.016072 2.078093
H  2.498054 -1.551533 3.359883
H  2.058933 -4.099125 -0.508884
H  3.820435 -3.899954 -0.533837
H  3.003257 -4.745324 -1.849515
H  3.76064 -1.363502 -3.357401
H  4.855509 -2.243865 -2.282526
H  4.014008 -3.09377 -3.579738
H  -3.612464 0.785841 -0.711347
H  -1.42124 0.811291 2.972573
H  -4.37005 -1.510063 -0.242987
H  -2.205104 -1.482919 3.446185
H  -3.667549 -2.648071 1.833661
totalener: -2439.75535753 hartree
nucrepener: 3006.63276777 hartree
electener: -5446.38812529 hartree
oneelecener: -9340.36020811 hartree
twoeener: 3893.97208281 hartree
kineticenergy: 2432.78203455 hartree
xcener: -161.481052452599 hartree
chargesum: 0.0000000
charge: 0.853516 -0.167204 -0.393939 0.631615 -0.335472 -0.342804 -0.464945 -0.477795 -0.227690 -0.116534 -0.070924 0.118181 0.113330 -0.029753 -0.245193 -0.224852 -0.249547 -0.211153 -0.145872 -0.144797 -0.113208 -0.106645 -0.106847 0.113570 0.116498 0.097174 0.115377 0.049754 0.063759 0.162773 0.095367 0.081721 0.099748 0.081752 0.096068 0.084258 0.094146 0.086469 0.088777 0.087989 0.084898 0.079406 0.131519 0.165011 0.126856 0.128174 0.127464
qa: 0.8535 -0.1672 -0.3939 0.6316 -0.3355 -0.3428 -0.4649 -0.4778 -0.2277 -0.1165 -0.0709 0.1182 0.1133 -0.0298 -0.2452 -0.2249 -0.2495 -0.2112 -0.1459 -0.1448 -0.1132 -0.1066 -0.1068 0.1136 0.1165 0.0972 0.1154 0.0498 0.0638 0.1628 0.0954 0.0817 0.0997 0.0818 0.0961 0.0843 0.0941 0.0865 0.0888 0.0880 0.0849 0.0794 0.1315 0.1650 0.1269 0.1282 0.1275
va: 5.9100 2.2985 2.0457 5.4437 2.1016 2.1140 2.0232 2.0183 3.0344 3.9586 3.7871 3.8765 3.8838 3.7988 3.9113 3.9092 3.9269 3.9316 3.9688 3.9335 3.9418 3.9557 3.9472 1.0023 1.0171 1.0627 1.0153 1.0232 1.0208 1.0547 1.0114 1.0071 1.0269 1.0223 1.0121 1.0116 1.0206 1.0062 1.0130 1.0135 1.0095 1.0092 1.0097 0.9982 1.0002 1.0001 0.9979
dispcorr: -0.032764538 hartree
energy: -2439.788122066256
dipole: 17.22792 -16.31867 0.90926 -16.99800 15.10960 -1.88840 1.83164 -2.50193 -0.67029
magnitude: 2.20047 au
magnitude: 5.59315 debye
