program: Gaussian 09
title: 000006237
version: EM64L-G09RevD.01
frameworkgroup: C1[X(C17H12I2O3)]
method: RPBEPBE
basis: SDD
operation: Freq
keyword: #p
keyword: freq=noraman
keyword: PBEPBE/SDD
title: #p freq=noraman PBEPBE/SDD
converged: YES YES NO NO
title: Mulliken charges:
elementType: I I O O O C C C C C C C C C C C C C C C C C H H H H H H H H H H H H
charge: 0.131106 0.155545 -0.246910 -0.232298 -0.378285 0.061398 0.146654 0.251483 0.143859 -0.485149 -0.012393 -0.349049 0.333077 -0.359413 -0.675367 -0.250224 -0.221473 -0.303045 -0.299128 -0.540760 -0.525182 0.564988 0.224964 0.249060 0.257217 0.256450 0.251770 0.222840 0.222931 0.230145 0.233658 0.294277 0.297003 0.350249
chargesum: 0.00000
title: Mulliken charges with hydrogens summed into heavy atoms:
elementType: I I O O O C C C C C C C C C C C C C C C C C
charge: 0.131106 0.155545 -0.246910 -0.232298 -0.028036 0.061398 0.146654 0.251483 0.143859 -0.011125 -0.012393 -0.091832 0.333077 -0.102963 0.022175 -0.020079 0.012185 -0.008768 -0.002125 -0.540760 -0.525182 0.564988
polarizability: 3.39570334e+02 -1.24198554e+01 2.89557633e+02 1.63595473e+01 2.71936626e+01 1.44259455e+02
1716.lowfreq: -3.9278 -1.5181 -0.0003 0.0004 0.0005 2.0992 17.1155 30.5207 35.8170
frequency: 17.0249 30.5086 35.8130 52.5593 73.7449 86.5214 89.2420 101.2297 104.1033 139.6281 159.9950 196.4744 200.3716 214.5792 227.2318 242.1236 272.7370 286.9633 311.8100 321.1251 364.7169 384.4046 436.0073 442.6962 458.7669 486.8329 489.5505 509.9268 539.7257 560.7130 597.7471 619.1966 640.4151 664.2550 681.7566 692.0793 727.1433 739.2428 757.8518 777.8399 780.3044 814.2792 826.1524 860.2371 884.7896 903.1259 925.5896 930.1238 943.7809 980.9698 982.7504 1014.3393 1026.1211 1040.5341 1059.8304 1090.1890 1123.9316 1133.7369 1159.4880 1166.5048 1211.0777 1230.6250 1237.3490 1279.4765 1284.4405 1296.1734 1312.6595 1351.0752 1372.3374 1384.6623 1388.9818 1407.9580 1438.2918 1443.8327 1450.2433 1464.9932 1474.4396 1486.5608 1512.9448 1542.4796 1565.1514 1580.3561 1588.3586 1624.6003 2993.5381 3007.6192 3076.3105 3094.1550 3109.4393 3138.2921 3154.6199 3168.7687 3170.4261 3173.0413 3179.0892 3433.7727
redmass: 7.7411 5.4290 7.7012 3.0414 10.4952 4.4507 12.2117 8.9729 7.3587 5.9886 5.4628 1.9177 2.6073 4.4929 5.5252 7.4287 2.4855 6.8319 7.1786 7.0986 5.5561 6.0703 3.5379 4.9145 1.2092 4.1798 4.4379 5.0134 4.4668 4.1653 4.7334 7.4534 6.4608 7.8449 9.4281 5.6461 6.6594 4.4681 1.3929 4.4655 1.3522 7.1356 5.0737 1.3701 3.5208 1.5900 6.5549 1.4755 1.3746 2.8884 1.3037 2.0360 3.9045 2.2452 1.8647 2.5425 2.2638 1.6159 1.9458 1.1805 2.1621 2.6231 1.6948 1.6677 1.5784 1.7736 1.4824 3.4775 3.3059 1.4472 4.4380 5.1299 2.9067 1.2087 3.7150 2.9146 1.0448 1.0672 7.3853 7.3228 8.4472 7.7642 6.9914 7.9406 1.0344 1.0612 1.0999 1.1001 1.1024 1.0861 1.0906 1.0952 1.0921 1.0931 1.0993 1.0648
irintensity: 0.1028 0.5897 0.0524 0.2496 0.0431 1.0933 0.1988 1.2236 3.0218 0.7044 0.4521 0.2396 0.8707 1.2348 2.0370 5.2376 3.0863 5.9239 5.0645 3.4192 0.2391 1.9135 3.1778 7.9175 107.9444 14.9588 3.7034 30.4107 6.8235 9.7009 3.3720 15.4512 14.4286 39.2664 70.6571 5.2794 13.0087 8.7364 73.5675 29.1693 2.8671 11.2231 7.9857 1.6412 54.5826 8.0784 15.2627 17.6446 2.1894 15.9816 0.3334 24.6471 21.1370 13.9292 43.6645 15.0948 150.1021 97.0698 62.8876 14.9585 75.1756 245.0951 53.2993 35.1978 17.1017 66.4892 4.4087 133.5088 18.9575 12.2195 29.7491 10.6494 30.8422 39.1182 41.6594 24.0916 8.9757 22.3681 184.9029 40.6766 313.9335 5.1907 5.8368 0.4304 43.1977 18.6889 4.5379 33.6536 25.1507 1.8817 12.9565 14.2409 1.1032 2.2161 10.7836 86.5786
temp: 298.150 k
press: 1.00000 atm
elementType: 53 53 8 8 8 6 6 6 6 6 6 6 6 6 6 6 6 6 6 6 6 6 1 1 1 1 1 1 1 1 1 1 1 1
symmnumber: 1
zpe: 634078.1 jmol-1
zpe.correction: 0.241508 hartree
zpe.thermalcorrener: 0.262017 hartree
zpe.thermalcorrenthalpy: 0.262961 hartree
zpe.thermalcorrgfe: 0.188098 hartree
zpe.sumelectzpe: -902.152908 hartree
zpe.sumelectthermal: -902.132399 hartree
zpe.sumelectthermalent: -902.131455 hartree
zpe.sumelectthermalfe: -902.206318 hartree
dipole: -1.8223 3.3320 0.2073
dipole: 3.8034
quadrupole: -148.7432 -151.1680 -154.1333
quadrupole: 1.3895 -0.1428 3.0829
quadrupole: 2.6050 0.1802 -2.7851 1.3895 -0.1428 3.0829
hfenergy: -902.3944161 hartree
pointgroup: C01 [X(C17H12I2O3)]
dipole: -0.4242827 -1.1541014 0.852772 debye
polarizability: 332.4803947|3.285386|257.0913397|-29.6080532|-71.0033543|183.8156867 unknown
InChI: InChI=1S/C17H12I2O3/c1-2-13-15(10-5-3-4-6-14(10)22-13)16(20)9-7-11(18)17(21)12(19)8-9/h3-8,21H,2H2,1H3
charge 0 multiplicity 1
34 atoms
I  3.408333 -1.686326 2.535494
I  5.041574 1.925649 -2.180896
O  -3.543655 0.046947 0.629233
O  -0.454722 2.481705 -1.076599
O  5.237712 -0.096671 0.270163
C  -1.395164 0.512156 -0.086028
C  -1.555192 -0.9488 -0.047553
C  -2.619741 1.064129 0.30738
C  -2.888105 -1.186334 0.393056
C  -3.12263 2.464099 0.440033
C  -0.254615 1.346239 -0.528253
C  -0.756212 -2.072647 -0.382589
C  1.15732 0.880757 -0.309861
C  -3.462984 -2.452653 0.551009
C  -3.924472 2.920064 -0.812629
C  -1.309742 -3.363107 -0.237572
C  -2.640233 -3.555868 0.228321
C  2.177956 1.439803 -1.12512
C  1.512762 -0.013307 0.732164
C  2.863475 -0.338406 0.936116
C  3.522086 1.097852 -0.924079
C  3.896826 0.198879 0.116009
H  -3.763349 2.530537 1.339283
H  -2.258549 3.137184 0.569216
H  0.265193 -1.949993 -0.753865
H  -4.493079 -2.574372 0.896577
H  -3.269372 2.91679 -1.699768
H  -4.30312 3.946469 -0.661895
H  -4.785956 2.255041 -0.99779
H  -0.701887 -4.237813 -0.492487
H  -3.036498 -4.571432 0.33056
H  1.885491 2.150594 -1.903115
H  0.742022 -0.426292 1.387352
H  5.380126 -0.722074 1.033832
