program: Orca
programVersion: 5.0.2
elementType: S S S P O O O O N C C C C C C C C C C C C C C H H H H H H H H H H H H H H H H H H H H H H H H
charge: 0
multiplicity: 1
keywords: wb97x-d3
keywords: def2-TZVPP
keywords: def2/J RIJCOSX
keywords: DEFGRID2
keywords: scfconv7
keywords: smallprint printgap noloewdin
keywords: NOSOSCF
formula: C14H24NO4PS3
InChI: InChI=1/C14H24NO4PS3/c1-12(2)18-20(21,19-13(3)4)22-11-10-15-23(16,17)14-8-6-5-7-9-14/h5-9,12-13,15H,10-11H2,1-4H3
47 atoms
S  -1.778646 2.191458 -0.653004
S  0.250255 -1.036809 1.801291
S  2.723139 1.009381 0.644057
P  1.748282 -0.643775 0.390522
O  1.027406 -0.848951 -1.01217
O  2.610575 -1.989291 0.474469
O  -1.119293 2.203413 -1.944168
O  -2.414741 3.397428 -0.15485
N  -0.658919 1.597627 0.415863
C  -1.028461 1.463786 1.808404
C  -0.020135 0.600414 2.546493
C  1.537413 -0.271168 -2.245451
C  3.482554 -2.237426 1.598488
C  -2.99298 0.897382 -0.593133
C  0.502384 -0.560309 -3.309837
C  2.898939 -0.840988 -2.59201
C  4.914595 -2.160701 1.111665
C  3.112924 -3.586905 2.176526
C  -2.603767 -0.421059 -0.790258
C  -4.320384 1.237509 -0.383367
C  -3.570087 -1.412379 -0.774811
C  -5.278996 0.235059 -0.378938
C  -4.90488 -1.085502 -0.573419
H  -2.010829 0.991335 1.859222
H  -1.104458 2.427732 2.32373
H  0.946484 1.0980 2.636131
H  -0.380526 0.401658 3.556519
H  1.613997 0.8090 -2.096558
H  3.322891 -1.465043 2.359103
H  0.268234 1.979769 0.243981
H  0.37377 -1.633381 -3.45712
H  0.829394 -0.127564 -4.255215
H  -0.457642 -0.111717 -3.064221
H  3.221766 -0.442614 -3.554071
H  3.657303 -0.568248 -1.858741
H  2.864204 -1.927935 -2.669783
H  5.140672 -1.168503 0.722162
H  5.10104 -2.895015 0.326989
H  5.601127 -2.363823 1.933996
H  3.234874 -4.378393 1.436163
H  3.755993 -3.818337 3.025761
H  2.080337 -3.59475 2.524534
H  -1.56096 -0.674081 -0.924076
H  -4.600569 2.269261 -0.222391
H  -3.278536 -2.444222 -0.915838
H  -6.317975 0.488787 -0.217668
H  -5.655016 -1.865209 -0.56313
totalener: -2439.75525349 hartree
nucrepener: 2964.65765071 hartree
electener: -5404.41290420 hartree
oneelecener: -9256.64327694 hartree
twoeener: 3852.23037274 hartree
kineticenergy: 2432.78116008 hartree
xcener: -161.473708765553 hartree
chargesum: 0.0000000
charge: 0.848534 -0.153735 -0.419705 0.629563 -0.313633 -0.336157 -0.475614 -0.469390 -0.253734 -0.099052 -0.116498 0.110186 0.114894 -0.105003 -0.234079 -0.228868 -0.239455 -0.214245 -0.070817 -0.048206 -0.193943 -0.155166 -0.068143 0.106983 0.119591 0.123557 0.116425 0.079997 0.057031 0.158634 0.085071 0.082276 0.102610 0.086732 0.083934 0.089302 0.094519 0.086406 0.085020 0.085654 0.079702 0.086018 0.141811 0.148244 0.129119 0.131927 0.131702
qa: 0.8485 -0.1537 -0.4197 0.6296 -0.3136 -0.3362 -0.4756 -0.4694 -0.2537 -0.0991 -0.1165 0.1102 0.1149 -0.1050 -0.2341 -0.2289 -0.2395 -0.2142 -0.0708 -0.0482 -0.1939 -0.1552 -0.0681 0.1070 0.1196 0.1236 0.1164 0.0800 0.0570 0.1586 0.0851 0.0823 0.1026 0.0867 0.0839 0.0893 0.0945 0.0864 0.0850 0.0857 0.0797 0.0860 0.1418 0.1482 0.1291 0.1319 0.1317
va: 5.8254 2.2966 2.0064 5.4279 2.1307 2.1114 1.9996 2.0225 2.9260 3.9580 3.8614 3.8648 3.8986 3.8119 3.9068 3.8962 3.9341 3.9272 3.8721 3.9090 4.0506 3.9760 3.9029 1.0009 1.0083 1.0413 1.0159 1.0211 1.0210 1.0637 1.0073 1.0127 1.0249 1.0115 1.0259 1.0113 1.0174 1.0076 1.0116 1.0097 1.0094 1.0177 1.0056 1.0197 1.0025 1.0001 0.9968
dispcorr: -0.030493944 hartree
energy: -2439.785747430563
dipole: 13.89135 -13.94749 -0.05613 -17.22414 15.38319 -1.84095 -1.42670 2.48223 1.05554
magnitude: 2.12283 au
magnitude: 5.39579 debye
