program: Orca
programVersion: 4.2.1
elementType: O O O O N N C C C C C C C C C C C C C C H H H H H H H H H H H H H H H H H H
charge: 0
multiplicity: 1
keywords: wb97x-d3
keywords: def2-TZVPP
keywords: def2/J RIJCOSX GRIDX6 NOFINALGRIDX
keywords: grid4 nofinalgrid
keywords: scfconv7
keywords: smallprint printgap noloewdin
keywords: NOSOSCF
formula: C14H18N2O4
InChI: InChI=1/C14H18N2O4/c1-10-5-4-6-11(2)13(10)16(12(17)9-19-3)15-7-8-20-14(15)18/h4-6H,7-9H2,1-3H3
38 atoms
O  2.439075 -1.165811 1.799121
O  1.70113 0.924161 2.067612
O  -0.3772 2.305442 -1.217565
O  2.790086 0.737726 -1.055046
N  0.815396 -0.506329 0.486226
N  -0.003099 0.374869 -0.158255
C  1.158084 -1.799546 -0.067784
C  -1.406522 0.082751 -0.123722
C  2.068139 -2.326015 1.03667
C  -1.978091 -0.596668 -1.202379
C  -2.160319 0.477865 0.985378
C  1.642947 -0.13776 1.499349
C  0.435861 1.508107 -0.784725
C  -3.33386 -0.911155 -1.134532
C  -3.5105 0.145614 1.011666
C  -1.197246 -1.010068 -2.415544
C  -1.559247 1.236656 2.128816
C  -4.092965 -0.550761 -0.035457
C  1.922262 1.822087 -0.887954
C  2.848817 0.284135 -2.392054
H  1.66597 -1.709164 -1.027756
H  0.277815 -2.427998 -0.19115
H  1.550167 -3.02144 1.69559
H  2.970941 -2.795508 0.65604
H  -3.795671 -1.439032 -1.959575
H  -4.112153 0.443902 1.861019
H  -0.754606 -1.999856 -2.286726
H  -1.852734 -1.069256 -3.283297
H  -0.392103 -0.323277 -2.669021
H  -2.344974 1.663342 2.750146
H  -0.956902 0.591987 2.769551
H  -0.920284 2.052729 1.795319
H  -5.145167 -0.800558 0.000617
H  2.205906 2.348932 0.026279
H  2.01753 2.542918 -1.707504
H  3.544038 -0.552605 -2.429798
H  3.21169 1.068177 -3.064243
H  1.878514 -0.057431 -2.768191
elementType: O N C H
totalener: -954.82059985 hartree
nucrepener: 1726.72454190 hartree
electener: -2681.54514175 hartree
oneelecener: -4732.31429197 hartree
twoeener: 2050.76915022 hartree
cpcmener: -0.04627744 hartree
kineticenergy: 950.79166062 hartree
xcener: -90.562402387936 hartree
chargesum: -0.0000000
charge: -0.299999 -0.476793 -0.496439 -0.371362 -0.009883 0.019651 -0.102774 0.150241 0.068923 -0.128806 -0.156903 0.400455 0.256244 -0.086599 -0.089682 -0.300263 -0.264599 -0.175770 0.051733 -0.137898 0.125642 0.121319 0.108935 0.107765 0.138886 0.139325 0.113481 0.115511 0.118640 0.104326 0.100661 0.104936 0.161183 0.135948 0.111919 0.127618 0.115057 0.099370
qa: -0.3000 -0.4768 -0.4964 -0.3714 -0.0099 0.0197 -0.1028 0.1502 0.0689 -0.1288 -0.1569 0.4005 0.2562 -0.0866 -0.0897 -0.3003 -0.2646 -0.1758 0.0517 -0.1379 0.1256 0.1213 0.1089 0.1078 0.1389 0.1393 0.1135 0.1155 0.1186 0.1043 0.1007 0.1049 0.1612 0.1359 0.1119 0.1276 0.1151 0.0994
va: 2.1110 2.0235 2.0046 1.9187 2.9835 2.9672 3.9588 3.5792 3.9243 3.8214 3.9316 4.4437 4.0706 3.8492 3.8301 3.9290 3.9093 3.9375 3.8090 3.8968 0.9850 0.9986 0.9969 0.9969 1.0020 1.0034 0.9883 1.0031 0.9885 1.0057 0.9994 1.0068 0.9891 1.0037 1.0167 0.9862 0.9976 0.9739
dispcorr: -0.022666755 hartree
energy: -954.843266601720
dipole: -1.10914 1.05374 -0.05541 -6.08752 2.76352 -3.32399 -8.68599 7.03789 -1.64810
magnitude: 3.71056 au
magnitude: 9.43149 debye
