program: Orca
programVersion: 4.2.1
elementType: O O O O N N C C C C C C C C C C C C C C H H H H H H H H H H H H H H H H H H
charge: 0
multiplicity: 1
keywords: wb97x-d3
keywords: def2-TZVPP
keywords: def2/J RIJCOSX GRIDX6 NOFINALGRIDX
keywords: grid4 nofinalgrid
keywords: scfconv7
keywords: smallprint printgap noloewdin
keywords: NOSOSCF
formula: C14H18N2O4
InChI: InChI=1/C14H18N2O4/c1-10-5-4-6-11(2)13(10)16(12(17)9-19-3)15-7-8-20-14(15)18/h4-6H,7-9H2,1-3H3
38 atoms
O  1.977341 -1.895695 2.053739
O  1.548638 0.26272 2.438048
O  0.010517 2.145436 -1.097727
O  2.670481 2.220224 -1.57085
N  0.840648 -0.814285 0.52289
N  0.079659 0.186936 -0.008402
C  0.834172 -2.171577 0.012442
C  -1.346329 0.041544 -0.019513
C  1.841017 -2.817573 0.959535
C  -1.947051 -0.573557 -1.122107
C  -2.100403 0.532019 1.052717
C  1.445888 -0.71372 1.74036
C  0.676924 1.239914 -0.640615
C  -3.329898 -0.747622 -1.105364
C  -3.477093 0.340256 1.026696
C  -1.183537 -1.050294 -2.3237
C  -1.480588 1.267005 2.201721
C  -4.087882 -0.305935 -0.036888
C  2.197259 1.223532 -0.71362
C  2.58588 1.872331 -2.937932
H  1.167465 -2.215535 -1.022406
H  -0.15819 -2.619592 0.09097
H  1.503182 -3.773642 1.349398
H  2.817412 -2.942778 0.49335
H  -3.811825 -1.227204 -1.948386
H  -4.078199 0.71275 1.846575
H  -0.197413 -0.603317 -2.426917
H  -1.05001 -2.133198 -2.300826
H  -1.736388 -0.820696 -3.233943
H  -0.963062 0.594637 2.884567
H  -0.759571 2.014188 1.871369
H  -2.250739 1.780629 2.774981
H  -5.160808 -0.446445 -0.039186
H  2.56066 0.229398 -1.003393
H  2.595552 1.433033 0.282752
H  2.990946 2.70342 -3.513283
H  1.558119 1.699274 -3.270667
H  3.175322 0.977054 -3.162623
elementType: O N C H
totalener: -954.82289182 hartree
nucrepener: 1693.82493559 hartree
electener: -2648.64782741 hartree
oneelecener: -4666.14538700 hartree
twoeener: 2017.49755958 hartree
cpcmener: -0.05291747 hartree
kineticenergy: 950.78490022 hartree
xcener: -90.561157207461 hartree
chargesum: 0.0000000
charge: -0.297374 -0.475294 -0.487212 -0.384560 -0.035628 0.010410 -0.073929 0.111110 0.071676 -0.132505 -0.129919 0.418057 0.268094 -0.096475 -0.091552 -0.280451 -0.259661 -0.170763 0.032419 -0.109168 0.117656 0.117961 0.109550 0.107569 0.139977 0.139784 0.098283 0.117075 0.118866 0.104339 0.100433 0.102790 0.161420 0.119324 0.139701 0.124570 0.092464 0.100962
qa: -0.2974 -0.4753 -0.4872 -0.3846 -0.0356 0.0104 -0.0739 0.1111 0.0717 -0.1325 -0.1299 0.4181 0.2681 -0.0965 -0.0916 -0.2805 -0.2597 -0.1708 0.0324 -0.1092 0.1177 0.1180 0.1095 0.1076 0.1400 0.1398 0.0983 0.1171 0.1189 0.1043 0.1004 0.1028 0.1614 0.1193 0.1397 0.1246 0.0925 0.1010
va: 2.1165 2.0228 2.0144 1.9390 2.9705 2.9770 3.9458 3.6035 3.9091 3.8553 3.9106 4.4185 4.0226 3.8500 3.8267 3.9301 3.9061 3.9333 3.9230 3.8825 0.9926 0.9924 0.9971 0.9968 1.0001 1.0033 0.9996 0.9867 1.0001 1.0032 1.0065 1.0052 0.9888 0.9945 1.0088 0.9902 0.9898 0.9922
dispcorr: -0.021216155 hartree
energy: -954.844107976048
dipole: -1.45681 1.13430 -0.32251 -4.79404 0.69830 -4.09574 -9.84640 8.16807 -1.67834
magnitude: 4.43801 au
magnitude: 11.28053 debye
