program: Orca
programVersion: 4.2.1
elementType: O O O O N N C C C C C C C C C C C C C C H H H H H H H H H H H H H H H H H H
charge: 0
multiplicity: 1
keywords: wb97x-d3
keywords: def2-TZVPP
keywords: def2/J RIJCOSX GRIDX6 NOFINALGRIDX
keywords: grid4 nofinalgrid
keywords: scfconv7
keywords: smallprint printgap noloewdin
keywords: NOSOSCF
formula: C14H18N2O4
InChI: InChI=1/C14H18N2O4/c1-10-5-4-6-11(2)13(10)16(12(17)9-19-3)15-7-8-20-14(15)18/h4-6H,7-9H2,1-3H3
38 atoms
O  2.415519 -2.575694 -1.103378
O  1.804842 -2.347352 1.028215
O  2.396573 0.583127 0.726749
O  0.042845 2.835645 1.069085
N  0.873032 -1.066921 -0.666415
N  0.330845 -0.107544 0.150599
C  1.291187 -0.749338 -2.02432
C  -1.091258 0.054341 0.118665
C  2.01187 -2.039357 -2.37474
C  -1.87549 -0.701485 1.001149
C  -1.662091 0.943033 -0.795468
C  1.705259 -2.014336 -0.12353
C  1.190772 0.69942 0.841689
C  -3.255744 -0.557209 0.94388
C  -3.052133 1.053972 -0.820561
C  -1.26736 -1.627996 2.008636
C  -0.874568 1.78072 -1.75803
C  -3.84245 0.311373 0.035442
C  0.558192 1.733133 1.766223
C  1.036966 3.674741 0.519471
H  1.953409 0.11852 -2.047775
H  0.441285 -0.573205 -2.679145
H  1.351473 -2.756939 -2.861437
H  2.895607 -1.885882 -2.987508
H  -3.876842 -1.129678 1.621152
H  -3.512513 1.737388 -1.523475
H  -2.047025 -2.093745 2.608421
H  -0.692319 -2.425121 1.542456
H  -0.59606 -1.106381 2.692356
H  -1.18338 2.823442 -1.692027
H  0.199108 1.75047 -1.600731
H  -1.062835 1.460169 -2.783656
H  -4.919353 0.41188 0.002189
H  1.332486 2.033221 2.481203
H  -0.263536 1.293709 2.333767
H  1.606224 3.196243 -0.283841
H  1.745921 4.014332 1.282009
H  0.534677 4.545237 0.101519
elementType: O N C H
totalener: -954.82175751 hartree
nucrepener: 1717.79315007 hartree
electener: -2672.61490758 hartree
oneelecener: -4714.59959409 hartree
twoeener: 2041.98468650 hartree
cpcmener: -0.04496435 hartree
kineticenergy: 950.79928643 hartree
xcener: -90.558630031766 hartree
chargesum: -0.0000000
charge: -0.295547 -0.476732 -0.479354 -0.363564 -0.046926 0.042274 -0.073633 0.128011 0.060552 -0.162525 -0.122796 0.428624 0.242922 -0.072583 -0.101956 -0.250784 -0.331495 -0.175857 0.075266 -0.121845 0.113520 0.114655 0.107930 0.110513 0.140451 0.140062 0.101157 0.108201 0.094005 0.119933 0.087722 0.133318 0.161041 0.112470 0.121359 0.094793 0.113247 0.123569
qa: -0.2955 -0.4767 -0.4794 -0.3636 -0.0469 0.0423 -0.0736 0.1280 0.0606 -0.1625 -0.1228 0.4286 0.2429 -0.0726 -0.1020 -0.2508 -0.3315 -0.1759 0.0753 -0.1218 0.1135 0.1147 0.1079 0.1105 0.1405 0.1401 0.1012 0.1082 0.0940 0.1199 0.0877 0.1333 0.1610 0.1125 0.1214 0.0948 0.1132 0.1236
va: 2.1173 2.0239 2.0208 1.9261 3.0104 3.0603 3.9362 3.5863 3.9217 3.8969 3.8022 4.4147 4.0801 3.8082 3.8491 3.9326 3.9419 3.9373 3.8547 3.8857 1.0041 0.9956 0.9967 0.9966 1.0019 0.9983 1.0063 1.0065 1.0003 0.9969 1.0018 0.9902 0.9892 1.0116 0.9961 0.9856 0.9971 0.9892
dispcorr: -0.022255089 hartree
energy: -954.844012600003
dipole: -6.07778 4.16059 -1.91719 10.57283 -9.06972 1.50310 -4.05730 1.58503 -2.47226
magnitude: 3.47088 au
magnitude: 8.82228 debye
