program: Orca
programVersion: 4.2.1
elementType: O O O O N N C C C C C C C C C C C C C C H H H H H H H H H H H H H H H H H H
charge: 0
multiplicity: 1
keywords: wb97x-d3
keywords: def2-TZVPP
keywords: def2/J RIJCOSX GRIDX6 NOFINALGRIDX
keywords: grid4 nofinalgrid
keywords: scfconv7
keywords: smallprint printgap noloewdin
keywords: NOSOSCF
formula: C14H18N2O4
InChI: InChI=1/C14H18N2O4/c1-10-5-4-6-11(2)13(10)16(12(17)9-19-3)15-7-8-20-14(15)18/h4-6H,7-9H2,1-3H3
38 atoms
O  1.931113 -1.917428 2.073215
O  1.507666 0.238247 2.463226
O  0.012689 2.130729 -1.131673
O  2.672998 2.229042 -1.575712
N  0.859922 -0.811264 0.510087
N  0.086613 0.190948 -0.006516
C  0.82091 -2.175359 0.019449
C  -1.338587 0.039629 -0.011411
C  1.830353 -2.819639 0.962187
C  -1.940501 -0.587343 -1.107503
C  -2.09533 0.536211 1.0570
C  1.420376 -0.728945 1.755848
C  0.679488 1.23514 -0.663392
C  -3.32156 -0.771926 -1.086155
C  -3.471497 0.337063 1.033045
C  -1.183098 -1.062404 -2.313883
C  -1.485119 1.281213 2.204971
C  -4.080675 -0.323959 -0.02158
C  2.201479 1.216428 -0.745643
C  2.607119 1.919046 -2.949497
H  1.138967 -2.244866 -1.018838
H  -0.177702 -2.606865 0.119189
H  1.512878 -3.792587 1.328064
H  2.814804 -2.911841 0.502925
H  -3.802273 -1.262977 -1.923745
H  -4.074559 0.716604 1.848653
H  -0.178481 -0.654747 -2.39672
H  -1.0966 -2.150527 -2.322183
H  -1.714907 -0.78312 -3.223526
H  -1.02448 0.607549 2.927144
H  -0.720762 1.987606 1.885013
H  -2.254281 1.842514 2.734419
H  -5.153113 -0.470848 -0.020638
H  2.557486 0.226712 -1.062028
H  2.608143 1.395181 0.2542
H  3.046561 2.753239 -3.495446
H  1.582897 1.782232 -3.310211
H  3.179071 1.014828 -3.188604
elementType: O N C H
totalener: -954.82680382 hartree
nucrepener: 1692.84396086 hartree
electener: -2647.67076469 hartree
oneelecener: -4664.10297579 hartree
twoeener: 2016.43221110 hartree
cpcmener: -0.04214153 hartree
kineticenergy: 950.79067006 hartree
xcener: -90.558862937553 hartree
chargesum: 0.0000000
charge: -0.287609 -0.444487 -0.455169 -0.366969 -0.045092 0.006232 -0.077777 0.117595 0.066113 -0.133746 -0.125193 0.402328 0.253842 -0.096370 -0.090288 -0.285781 -0.256778 -0.168141 0.036003 -0.111483 0.115745 0.116085 0.107624 0.104105 0.136911 0.136181 0.092567 0.116452 0.120777 0.102911 0.101451 0.101133 0.157534 0.109861 0.133017 0.121858 0.093255 0.095305
qa: -0.2876 -0.4445 -0.4552 -0.3670 -0.0451 0.0062 -0.0778 0.1176 0.0661 -0.1337 -0.1252 0.4023 0.2538 -0.0964 -0.0903 -0.2858 -0.2568 -0.1681 0.0360 -0.1115 0.1157 0.1161 0.1076 0.1041 0.1369 0.1362 0.0926 0.1165 0.1208 0.1029 0.1015 0.1011 0.1575 0.1099 0.1330 0.1219 0.0933 0.0953
va: 2.1233 2.0605 2.0549 1.9582 2.9630 2.9686 3.9432 3.6212 3.9206 3.8555 3.9181 4.4361 4.0480 3.8561 3.8299 3.9283 3.9073 3.9431 3.9345 3.8904 0.9927 0.9929 0.9963 0.9962 1.0004 1.0040 1.0022 0.9867 0.9997 1.0027 1.0075 1.0039 0.9901 0.9958 1.0093 0.9910 0.9900 0.9923
dispcorr: -0.021150218 hartree
energy: -954.847954039202
dipole: -1.37470 1.10393 -0.27077 -4.64437 0.85193 -3.79244 -9.90221 8.31324 -1.58897
magnitude: 4.12077 au
magnitude: 10.47416 debye
