program: Orca
programVersion: 4.2.1
elementType: Cl O O O N C C C C C C C C C C C C C C H H H H H H H H H H H H H H H H
charge: 0
multiplicity: 1
keywords: wb97x-d3
keywords: def2-TZVPP
keywords: def2/J RIJCOSX GRIDX6 NOFINALGRIDX
keywords: grid4 nofinalgrid
keywords: scfconv7
keywords: smallprint printgap noloewdin
keywords: NOSOSCF
formula: C14H16ClNO3
InChI: InChI=1/C14H16ClNO3/c1-9-4-3-5-10(2)13(9)16(12(17)8-15)11-6-7-19-14(11)18/h3-5,11H,6-8H2,1-2H3
35 atoms
Cl -1.236115 -2.807858 0.701202
O  3.667825 0.735907 -0.352479
O  2.377547 1.967576 0.953104
O  1.822737 -1.196442 1.105902
N  0.298411 0.029126 0.01487
C  1.367115 0.588399 -0.797224
C  2.091708 -0.368947 -1.748875
C  3.55318 -0.332024 -1.30468
C  -1.038136 0.504273 -0.153569
C  2.487288 1.168714 0.061812
C  -1.577936 1.393245 0.782399
C  -1.762888 0.093682 -1.278621
C  0.650327 -0.895977 0.932594
C  -2.884694 1.835626 0.58935
C  -3.05796 0.573322 -1.441501
C  -0.806546 1.915598 1.958647
C  -1.173852 -0.814161 -2.313726
C  -0.442519 -1.576542 1.728948
C  -3.619497 1.433016 -0.511793
H  0.934912 1.424545 -1.34796
H  1.991987 -0.016894 -2.773331
H  1.693169 -1.380057 -1.71173
H  3.865873 -1.254087 -0.817813
H  4.23851 -0.119326 -2.12178
H  -3.324474 2.510712 1.312932
H  -3.632166 0.262529 -2.305233
H  -0.251314 2.813122 1.682188
H  -1.487145 2.19009 2.763075
H  -0.081839 1.216104 2.368762
H  -0.640831 -1.655907 -1.874988
H  -1.953711 -1.216392 -2.958299
H  -0.472459 -0.281324 -2.958918
H  0.007698 -2.089333 2.5741
H  -1.212391 -0.901751 2.092486
H  -4.631957 1.790075 -0.647011
elementType: Cl O N C H
totalener: -1283.88192518 hartree
nucrepener: 1683.01200467 hartree
electener: -2966.89392984 hartree
oneelecener: -5101.86307564 hartree
twoeener: 2134.96914579 hartree
cpcmener: -0.03790969 hartree
kineticenergy: 1279.67225304 hartree
xcener: -100.202292097140 hartree
chargesum: 0.0000000
charge: -0.149984 -0.266606 -0.435361 -0.495745 0.029136 0.092873 -0.175487 0.054588 0.058861 0.331993 -0.173556 -0.130342 0.272290 -0.071566 -0.077629 -0.256211 -0.299062 -0.046644 -0.185241 0.133026 0.108775 0.101923 0.100066 0.109220 0.140747 0.139977 0.109838 0.110987 0.088891 0.095014 0.109161 0.114277 0.150703 0.149426 0.161664
qa: -0.1500 -0.2666 -0.4354 -0.4957 0.0291 0.0929 -0.1755 0.0546 0.0589 0.3320 -0.1736 -0.1303 0.2723 -0.0716 -0.0776 -0.2562 -0.2991 -0.0466 -0.1852 0.1330 0.1088 0.1019 0.1001 0.1092 0.1407 0.1400 0.1098 0.1110 0.0889 0.0950 0.1092 0.1143 0.1507 0.1494 0.1617
va: 1.1235 2.1283 2.0589 2.0154 2.9807 3.6642 3.9571 3.8722 3.5563 4.2618 3.8838 3.7999 4.1355 3.8124 3.8098 3.9333 3.9518 3.9640 3.9510 0.9993 1.0067 1.0095 1.0024 0.9968 0.9990 1.0024 1.0030 1.0002 1.0074 1.0152 1.0059 0.9869 1.0112 1.0077 0.9889
dispcorr: -0.021546894 hartree
energy: -1283.903472072685
dipole: -3.19400 1.40952 -1.78449 7.14415 -7.32907 -0.18492 -7.39898 5.37479 -2.02419
magnitude: 2.70480 au
magnitude: 6.87505 debye
