program: Orca
programVersion: 4.2.1
elementType: S O N C C C C C C C C C C C H H H H H H H H H H H H H H H H H H H
charge: 0
multiplicity: 1
keywords: wb97x-d3
keywords: def2-TZVPP
keywords: def2/J RIJCOSX GRIDX6 NOFINALGRIDX
keywords: grid4 nofinalgrid
keywords: scfconv7
keywords: smallprint printgap noloewdin
keywords: NOSOSCF
formula: C11H19NOS
InChI: InChI=1/C11H19NOS/c1-2-3-4-5-6-7-9-12-11(13)8-10-14-12/h8,10H,2-7,9H2,1H3
33 atoms
S  -0.919454 0.958867 0.807113
O  -3.230192 -0.198218 -1.926801
N  -1.772164 -0.132825 -0.1654
C  1.512275 -1.9273 0.500185
C  0.874005 -1.612038 -0.849178
C  3.012185 -1.639107 0.547837
C  -0.549316 -2.137264 -1.007803
C  3.403813 -0.1739 0.372493
C  -1.576167 -1.569351 -0.038238
C  2.962638 0.729562 1.517306
C  3.381576 2.177847 1.31649
C  -2.556989 0.448209 -1.125355
C  -2.448793 1.892226 -1.00777
C  -1.613179 2.279373 -0.030072
H  1.356598 -2.987434 0.724273
H  1.006163 -1.381495 1.302822
H  1.484107 -2.062559 -1.638023
H  0.897857 -0.535674 -1.04125
H  3.503664 -2.234333 -0.228095
H  3.412597 -1.998566 1.501038
H  -0.552661 -3.222449 -0.870362
H  -0.89347 -1.958037 -2.029012
H  3.004254 0.213464 -0.570472
H  4.492698 -0.112912 0.278788
H  -1.309857 -1.785477 0.996746
H  -2.543939 -2.042189 -0.204586
H  1.876511 0.685984 1.629799
H  3.380309 0.351825 2.455702
H  3.062432 2.807564 2.148055
H  4.466108 2.270379 1.231634
H  2.945253 2.592412 0.405531
H  -2.990833 2.56687 -1.652526
H  -1.357866 3.287091 0.262733
elementType: S O N C H
totalener: -958.85434120 hartree
nucrepener: 1050.84767167 hartree
electener: -2009.70201287 hartree
oneelecener: -3395.82426406 hartree
twoeener: 1386.12225119 hartree
cpcmener: -0.02623005 hartree
kineticenergy: 955.52114526 hartree
xcener: -75.351052325654 hartree
chargesum: -0.0000000
charge: 0.109322 -0.594519 -0.044930 -0.135544 -0.154704 -0.148421 -0.116884 -0.127760 -0.119345 -0.100922 -0.279031 0.347022 -0.279828 -0.053480 0.084268 0.059834 0.083949 0.072081 0.074686 0.074301 0.080205 0.085126 0.064237 0.077729 0.126835 0.111767 0.051175 0.063667 0.091828 0.081694 0.075998 0.162249 0.177396
qa: 0.1093 -0.5945 -0.0449 -0.1355 -0.1547 -0.1484 -0.1169 -0.1278 -0.1193 -0.1009 -0.2790 0.3470 -0.2798 -0.0535 0.0843 0.0598 0.0839 0.0721 0.0747 0.0743 0.0802 0.0851 0.0642 0.0777 0.1268 0.1118 0.0512 0.0637 0.0918 0.0817 0.0760 0.1622 0.1774
va: 2.5686 1.9042 3.0625 3.8493 3.8690 3.9200 3.8474 3.8518 3.8635 3.8649 3.9391 4.1642 3.9334 3.9831 1.0151 0.9958 1.0133 1.0028 1.0091 1.0088 1.0158 1.0233 1.0046 1.0091 0.9932 1.0225 1.0095 1.0123 1.0031 1.0023 1.0025 0.9976 0.9838
dispcorr: -0.014859964 hartree
energy: -958.869201160375
dipole: 23.95286 -22.41320 1.53966 -5.37791 6.04400 0.66609 4.37384 -2.80358 1.57025
magnitude: 2.29781 au
magnitude: 5.84057 debye
