program: Orca
programVersion: 4.2.1
elementType: S O N C C C C C C C C C C C H H H H H H H H H H H H H H H H H H H
charge: 0
multiplicity: 1
keywords: wb97x-d3
keywords: def2-TZVPP
keywords: def2/J RIJCOSX GRIDX6 NOFINALGRIDX
keywords: grid4 nofinalgrid
keywords: scfconv7
keywords: smallprint printgap noloewdin
keywords: NOSOSCF
formula: C11H19NOS
InChI: InChI=1/C11H19NOS/c1-2-3-4-5-6-7-9-12-11(13)8-10-14-12/h8,10H,2-7,9H2,1H3
33 atoms
S  -2.219744 0.195791 1.077142
O  -0.93755 0.581866 -2.443751
N  -1.794302 -0.272733 -0.49504
C  1.131866 -1.176881 0.388305
C  0.527108 -2.461886 -0.167098
C  2.655631 -1.194274 0.391658
C  -0.985568 -2.602952 -0.020431
C  3.280548 0.078624 0.95661
C  -1.844108 -1.67678 -0.871942
C  2.99247 1.335239 0.142065
C  3.701015 2.564077 0.691134
C  -1.3101 0.739181 -1.282615
C  -1.321189 1.974298 -0.51623
C  -1.774223 1.812194 0.737075
H  0.772378 -1.011875 1.409813
H  0.791326 -0.322954 -0.197169
H  0.985557 -3.311773 0.348025
H  0.799004 -2.5684 -1.222278
H  3.020675 -1.355979 -0.628503
H  3.0022 -2.05195 0.976732
H  -1.267279 -2.515765 1.033929
H  -1.269199 -3.616599 -0.313559
H  4.364851 -0.056647 1.021787
H  2.93217 0.226555 1.984841
H  -2.883259 -2.009337 -0.836806
H  -1.533569 -1.724005 -1.915134
H  3.296873 1.169997 -0.896253
H  1.916392 1.528516 0.115337
H  3.39242 2.772866 1.717227
H  4.784344 2.430334 0.695132
H  3.48157 3.451515 0.096105
H  -0.987969 2.913464 -0.930003
H  -1.883335 2.564951 1.503636
elementType: S O N C H
totalener: -958.85381167 hartree
nucrepener: 1055.35130090 hartree
electener: -2014.20511257 hartree
oneelecener: -3405.34649645 hartree
twoeener: 1391.14138388 hartree
cpcmener: -0.02585876 hartree
kineticenergy: 955.52370276 hartree
xcener: -75.350434965263 hartree
chargesum: -0.0000000
charge: 0.119099 -0.582440 -0.061719 -0.072365 -0.107763 -0.144862 -0.142797 -0.126168 -0.094503 -0.064464 -0.288825 0.322282 -0.287470 -0.045631 0.060643 0.013914 0.073117 0.067170 0.064452 0.071641 0.075114 0.092677 0.071484 0.059257 0.137114 0.100003 0.059897 0.039667 0.078718 0.081611 0.090607 0.162951 0.177585
qa: 0.1191 -0.5824 -0.0617 -0.0724 -0.1078 -0.1449 -0.1428 -0.1262 -0.0945 -0.0645 -0.2888 0.3223 -0.2875 -0.0456 0.0606 0.0139 0.0731 0.0672 0.0645 0.0716 0.0751 0.0927 0.0715 0.0593 0.1371 0.1000 0.0599 0.0397 0.0787 0.0816 0.0906 0.1630 0.1776
va: 2.5631 1.9215 3.0835 3.8548 3.8673 3.9496 3.8924 3.8916 3.8335 3.8536 3.9511 4.1726 3.9013 3.9726 1.0169 1.0278 1.0085 1.0098 1.0079 1.0119 1.0084 1.0148 1.0099 1.0082 0.9991 1.0298 1.0071 1.0054 1.0001 1.0013 1.0032 0.9987 0.9834
dispcorr: -0.014958664 hartree
energy: -958.868770329210
dipole: 22.51281 -23.14822 -0.63541 -3.34812 3.04118 -0.30694 3.82457 -1.63367 2.19090
magnitude: 2.30174 au
magnitude: 5.85057 debye
