program: Orca
programVersion: 4.2.1
elementType: S O N C C C C C C C C C C C H H H H H H H H H H H H H H H H H H H
charge: 0
multiplicity: 1
keywords: wb97x-d3
keywords: def2-TZVPP
keywords: def2/J RIJCOSX GRIDX6 NOFINALGRIDX
keywords: grid4 nofinalgrid
keywords: scfconv7
keywords: smallprint printgap noloewdin
keywords: NOSOSCF
formula: C11H19NOS
InChI: InChI=1/C11H19NOS/c1-2-3-4-5-6-7-9-12-11(13)8-10-14-12/h8,10H,2-7,9H2,1H3
33 atoms
S  -2.732271 -0.031037 1.145516
O  -2.469644 0.386511 -2.585012
N  -2.139179 -0.278199 -0.422276
C  2.054439 1.126806 0.418417
C  0.753759 0.334108 0.53506
C  3.295045 0.324973 0.029576
C  0.335839 -0.348121 -0.761044
C  3.648326 -0.788652 1.0095
C  -0.974775 -1.116244 -0.667612
C  4.955859 -1.5088 0.685442
C  6.198445 -0.640344 0.830223
C  -2.784568 0.434106 -1.397295
C  -3.855501 1.201942 -0.785209
C  -3.924992 1.03961 0.546168
H  2.24383 1.622957 1.375069
H  1.909926 1.928029 -0.312743
H  -0.028235 1.027527 0.856093
H  0.833978 -0.413661 1.330345
H  4.13081 1.025594 -0.046983
H  3.17364 -0.100595 -0.971787
H  1.095273 -1.073178 -1.065339
H  0.270663 0.385584 -1.569141
H  2.841278 -1.526897 1.029116
H  3.705814 -0.376026 2.023156
H  -0.923681 -1.864189 0.124955
H  -1.159027 -1.661073 -1.593364
H  5.053759 -2.374187 1.3461
H  4.90635 -1.910157 -0.331394
H  6.277666 -0.23148 1.839522
H  7.104499 -1.216944 0.639058
H  6.200543 0.199486 0.134504
H  -4.514796 1.833802 -1.360022
H  -4.624288 1.495117 1.231485
elementType: S O N C H
totalener: -958.85428219 hartree
nucrepener: 998.19063156 hartree
electener: -1957.04491376 hartree
oneelecener: -3290.76048598 hartree
twoeener: 1333.71557223 hartree
cpcmener: -0.02630145 hartree
kineticenergy: 955.51407477 hartree
xcener: -75.348395154613 hartree
chargesum: -0.0000000
charge: 0.123271 -0.594542 -0.071881 -0.169524 -0.156771 -0.146414 -0.091522 -0.117137 -0.105813 -0.111688 -0.275059 0.346786 -0.278875 -0.058974 0.076043 0.078197 0.081389 0.081586 0.083245 0.069654 0.080871 0.076784 0.070474 0.064348 0.121489 0.111585 0.070867 0.054472 0.079279 0.090864 0.077533 0.161422 0.178036
qa: 0.1233 -0.5945 -0.0719 -0.1695 -0.1568 -0.1464 -0.0915 -0.1171 -0.1058 -0.1117 -0.2751 0.3468 -0.2789 -0.0590 0.0760 0.0782 0.0814 0.0816 0.0832 0.0697 0.0809 0.0768 0.0705 0.0643 0.1215 0.1116 0.0709 0.0545 0.0793 0.0909 0.0775 0.1614 0.1780
va: 2.5609 1.9024 3.0862 3.9414 3.8605 3.8617 3.7679 3.8577 3.8723 3.8997 3.9286 4.1653 3.9303 3.9763 1.0068 1.0068 1.0164 0.9980 1.0104 1.0013 1.0147 1.0248 1.0106 1.0090 1.0018 1.0191 1.0050 1.0084 1.0005 1.0044 1.0001 0.9984 0.9831
dispcorr: -0.013157947 hartree
energy: -958.867440142252
dipole: 36.29375 -36.38412 -0.09037 -2.92104 2.75564 -0.16539 4.35805 -2.07628 2.28177
magnitude: 2.28954 au
magnitude: 5.81955 debye
