program: Orca
programVersion: 4.2.1
elementType: S O N C C C C C C C C C C C H H H H H H H H H H H H H H H H H H H
charge: 0
multiplicity: 1
keywords: wb97x-d3
keywords: def2-TZVPP
keywords: def2/J RIJCOSX GRIDX6 NOFINALGRIDX
keywords: grid4 nofinalgrid
keywords: scfconv7
keywords: smallprint printgap noloewdin
keywords: NOSOSCF
formula: C11H19NOS
InChI: InChI=1/C11H19NOS/c1-2-3-4-5-6-7-9-12-11(13)8-10-14-12/h8,10H,2-7,9H2,1H3
33 atoms
S  -2.262127 0.207949 1.180696
O  -1.124613 0.689775 -2.372341
N  -1.831472 -0.224511 -0.398511
C  1.927253 -2.185663 0.556365
C  0.401255 -2.157871 0.584317
C  2.583633 -0.912173 0.02089
C  -0.23209 -2.077757 -0.801277
C  2.205851 0.351644 0.785996
C  -1.683095 -1.618299 -0.796837
C  2.909486 1.613674 0.294601
C  4.423767 1.589272 0.448923
C  -1.479065 0.828141 -1.203036
C  -1.610223 2.061441 -0.447322
C  -2.013157 1.862132 0.818271
H  2.264433 -3.038045 -0.041725
H  2.292288 -2.367268 1.571677
H  0.077647 -1.317623 1.203434
H  0.031459 -3.052201 1.093045
H  2.342863 -0.774983 -1.038278
H  3.666636 -1.055235 0.057965
H  -0.195813 -3.06097 -1.277458
H  0.33574 -1.410276 -1.452417
H  2.41854 0.209078 1.851528
H  1.126511 0.517989 0.713744
H  -2.288208 -2.23109 -0.127103
H  -2.121499 -1.725178 -1.789099
H  2.651321 1.785596 -0.754936
H  2.511277 2.470128 0.845282
H  4.889388 0.818873 -0.166817
H  4.864178 2.543211 0.155388
H  4.713148 1.400753 1.485066
H  -1.398708 3.0278 -0.878932
H  -2.191162 2.604723 1.582104
elementType: S O N C H
totalener: -958.85293558 hartree
nucrepener: 1057.08368240 hartree
electener: -2015.93661797 hartree
oneelecener: -3408.83598802 hartree
twoeener: 1392.89937005 hartree
cpcmener: -0.02558076 hartree
kineticenergy: 955.51635912 hartree
xcener: -75.350436224335 hartree
chargesum: -0.0000000
charge: 0.123749 -0.586797 -0.063329 -0.161192 -0.154013 -0.144079 -0.101479 -0.074275 -0.104989 -0.112337 -0.279676 0.335199 -0.282295 -0.045555 0.074957 0.077556 0.055872 0.093435 0.068619 0.083180 0.090744 0.074035 0.073703 0.015715 0.115116 0.113697 0.054718 0.069114 0.079500 0.092126 0.080408 0.161468 0.177106
qa: 0.1237 -0.5868 -0.0633 -0.1612 -0.1540 -0.1441 -0.1015 -0.0743 -0.1050 -0.1123 -0.2797 0.3352 -0.2823 -0.0456 0.0750 0.0776 0.0559 0.0934 0.0686 0.0832 0.0907 0.0740 0.0737 0.0157 0.1151 0.1137 0.0547 0.0691 0.0795 0.0921 0.0804 0.1615 0.1771
va: 2.5621 1.9108 3.0760 3.9409 3.8581 3.8708 3.7669 3.8526 3.9021 3.8960 3.9401 4.1528 3.9181 3.9584 1.0078 1.0068 1.0183 1.0119 1.0033 1.0094 1.0159 1.0316 1.0108 1.0236 0.9997 1.0147 1.0094 1.0060 0.9983 1.0045 0.9998 0.9995 0.9832
dispcorr: -0.015328138 hartree
energy: -958.868263714005
dipole: 24.47937 -24.99386 -0.51449 -4.54049 4.27757 -0.26292 2.73124 -0.54436 2.18688
magnitude: 2.26192 au
magnitude: 5.74934 debye
