program: Orca
programVersion: 4.2.1
elementType: S O N C C C C C C C C C C C H H H H H H H H H H H H H H H H H H H
charge: 0
multiplicity: 1
keywords: wb97x-d3
keywords: def2-TZVPP
keywords: def2/J RIJCOSX GRIDX6 NOFINALGRIDX
keywords: grid4 nofinalgrid
keywords: scfconv7
keywords: smallprint printgap noloewdin
keywords: NOSOSCF
formula: C11H19NOS
InChI: InChI=1/C11H19NOS/c1-2-3-4-5-6-7-9-12-11(13)8-10-14-12/h8,10H,2-7,9H2,1H3
33 atoms
S  -1.659203 1.742954 0.174191
O  -3.420468 -1.162087 -1.449174
N  -1.823455 0.268287 -0.644332
C  2.149325 -1.74755 -0.396601
C  0.85638 -2.354785 0.143751
C  2.774358 -0.685872 0.500414
C  -0.278589 -1.366669 0.39854
C  4.106959 -0.183768 -0.044267
C  -0.66746 -0.586813 -0.849092
C  4.750908 0.928727 0.77749
C  5.127037 0.517327 2.193929
C  -3.116658 -0.099918 -0.909477
C  -4.004926 0.957248 -0.455897
C  -3.35661 1.97232 0.136957
H  1.982472 -1.328277 -1.394095
H  2.870943 -2.55767 -0.538742
H  1.070776 -2.877202 1.080093
H  0.5068 -3.119986 -0.555496
H  2.906766 -1.101859 1.504134
H  2.094578 0.166006 0.612296
H  -0.00644 -0.671078 1.19756
H  -1.152578 -1.91657 0.756074
H  3.953874 0.177622 -1.066154
H  4.804529 -1.024892 -0.123609
H  -0.917315 -1.266081 -1.664164
H  0.15433 0.035153 -1.206935
H  5.649366 1.27199 0.257656
H  4.076524 1.789808 0.814119
H  4.253433 0.258279 2.793261
H  5.792111 -0.34887 2.190516
H  5.64473 1.324711 2.713772
H  -5.07523 0.905744 -0.584939
H  -3.780188 2.870987 0.56068
elementType: S O N C H
totalener: -958.85528585 hartree
nucrepener: 996.75497438 hartree
electener: -1955.61026023 hartree
oneelecener: -3287.69701589 hartree
twoeener: 1332.08675566 hartree
cpcmener: -0.02602113 hartree
kineticenergy: 955.51413412 hartree
xcener: -75.347299777450 hartree
chargesum: 0.0000000
charge: 0.117193 -0.594077 -0.068666 -0.137549 -0.162220 -0.128631 -0.116008 -0.117039 -0.096347 -0.110428 -0.278344 0.341783 -0.275815 -0.060485 0.068830 0.079377 0.076501 0.083626 0.070951 0.058469 0.072072 0.095121 0.069120 0.063880 0.105114 0.127058 0.070580 0.054320 0.079680 0.080233 0.091838 0.162213 0.177650
qa: 0.1172 -0.5941 -0.0687 -0.1375 -0.1622 -0.1286 -0.1160 -0.1170 -0.0963 -0.1104 -0.2783 0.3418 -0.2758 -0.0605 0.0688 0.0794 0.0765 0.0836 0.0710 0.0585 0.0721 0.0951 0.0691 0.0639 0.1051 0.1271 0.0706 0.0543 0.0797 0.0802 0.0918 0.1622 0.1776
va: 2.5573 1.9038 3.0937 3.8632 3.9320 3.8432 3.8436 3.8776 3.7912 3.8961 3.9272 4.1693 3.9285 3.9921 1.0049 1.0098 1.0075 1.0067 1.0080 1.0047 1.0132 1.0200 1.0116 1.0092 1.0268 0.9986 1.0071 1.0083 0.9980 1.0001 1.0044 0.9973 0.9838
dispcorr: -0.012782654 hartree
energy: -958.868068504449
dipole: 32.51083 -31.44338 1.06745 -7.16601 8.85668 1.69067 6.96672 -5.89636 1.07036
magnitude: 2.26792 au
magnitude: 5.76460 debye
