program: Orca
programVersion: 4.2.1
elementType: S O N C C C C C C C C C C C H H H H H H H H H H H H H H H H H H H
charge: 0
multiplicity: 1
keywords: wb97x-d3
keywords: def2-TZVPP
keywords: def2/J RIJCOSX GRIDX6 NOFINALGRIDX
keywords: grid4 nofinalgrid
keywords: scfconv7
keywords: smallprint printgap noloewdin
keywords: NOSOSCF
formula: C11H19NOS
InChI: InChI=1/C11H19NOS/c1-2-3-4-5-6-7-9-12-11(13)8-10-14-12/h8,10H,2-7,9H2,1H3
33 atoms
S  -1.330467 0.689739 -1.587829
O  -1.938462 -0.183229 2.025883
N  -1.623263 -0.301748 -0.24403
C  1.147507 -1.637543 0.951462
C  0.576852 -2.781287 0.118353
C  1.819274 -0.527667 0.153375
C  -0.474217 -2.42788 -0.932852
C  2.248041 0.643735 1.029889
C  -1.741399 -1.740977 -0.428359
C  2.779824 1.842977 0.252136
C  4.056587 1.560954 -0.526335
C  -1.704828 0.365423 0.950012
C  -1.475688 1.780984 0.712692
C  -1.266534 2.072414 -0.580366
H  1.878835 -2.061601 1.647155
H  0.36398 -1.214969 1.584581
H  0.145675 -3.521761 0.798671
H  1.396645 -3.291743 -0.396159
H  1.143699 -0.150061 -0.619805
H  2.681044 -0.94071 -0.380373
H  -0.796344 -3.359919 -1.40269
H  -0.030426 -1.840727 -1.742433
H  3.003835 0.30977 1.749534
H  1.387352 0.968499 1.623694
H  -2.053539 -2.154036 0.530511
H  -2.559381 -1.925904 -1.12683
H  2.002162 2.197479 -0.432685
H  2.962966 2.664483 0.949941
H  3.906993 0.810617 -1.303703
H  4.428345 2.462209 -1.015828
H  4.847438 1.197235 0.133119
H  -1.481437 2.506069 1.511985
H  -1.080759 3.041187 -1.020103
elementType: S O N C H
totalener: -958.85271213 hartree
nucrepener: 1081.08448805 hartree
electener: -2039.93720018 hartree
oneelecener: -3456.73380757 hartree
twoeener: 1416.79660739 hartree
cpcmener: -0.02537001 hartree
kineticenergy: 955.51776852 hartree
xcener: -75.351674369886 hartree
chargesum: 0.0000000
charge: 0.114916 -0.580549 -0.045084 -0.133858 -0.142820 -0.155741 -0.137772 -0.142996 -0.095287 -0.110313 -0.275180 0.311824 -0.278232 -0.053658 0.086026 0.063899 0.077653 0.075303 0.052184 0.084726 0.093487 0.073584 0.078752 0.075290 0.102624 0.140220 0.051828 0.072679 0.080162 0.092297 0.080376 0.162017 0.181643
qa: 0.1149 -0.5805 -0.0451 -0.1339 -0.1428 -0.1557 -0.1378 -0.1430 -0.0953 -0.1103 -0.2752 0.3118 -0.2782 -0.0537 0.0860 0.0639 0.0777 0.0753 0.0522 0.0847 0.0935 0.0736 0.0788 0.0753 0.1026 0.1402 0.0518 0.0727 0.0802 0.0923 0.0804 0.1620 0.1816
va: 2.5522 1.9154 3.0715 3.8448 3.8935 3.8301 3.8554 3.8731 3.8106 3.8845 3.9299 4.1733 3.9019 3.9498 1.0097 1.0305 1.0091 1.0075 1.0156 1.0107 1.0124 1.0062 1.0095 1.0059 1.0293 0.9979 1.0101 1.0075 0.9982 1.0045 1.0007 1.0000 0.9811
dispcorr: -0.016775877 hartree
energy: -958.869488002852
dipole: 20.98175 -20.50654 0.47521 -4.09729 4.61259 0.51530 1.12892 -3.28813 -2.15921
magnitude: 2.27014 au
magnitude: 5.77024 debye
