program: Orca
programVersion: 4.2.1
elementType: S O N C C C C C C C C C C C H H H H H H H H H H H H H H H H H H H
charge: 0
multiplicity: 1
keywords: wb97x-d3
keywords: def2-TZVPP
keywords: def2/J RIJCOSX GRIDX6 NOFINALGRIDX
keywords: grid4 nofinalgrid
keywords: scfconv7
keywords: smallprint printgap noloewdin
keywords: NOSOSCF
formula: C11H19NOS
InChI: InChI=1/C11H19NOS/c1-2-3-4-5-6-7-9-12-11(13)8-10-14-12/h8,10H,2-7,9H2,1H3
33 atoms
S  -1.398075 1.478559 0.17398
O  -3.614684 -1.208803 -1.248438
N  -1.840308 0.161116 -0.793535
C  1.749284 -0.476825 0.110407
C  0.572447 -1.423176 0.315221
C  2.544811 -0.250514 1.390388
C  -0.220463 -1.729389 -0.950886
C  3.638002 0.807517 1.265739
C  -0.865101 -0.52686 -1.626134
C  4.71664 0.511011 0.226588
C  5.479852 -0.779259 0.488396
C  -3.136618 -0.25265 -0.639631
C  -3.795508 0.618181 0.318419
C  -2.981544 1.56309 0.816888
H  1.403347 0.494543 -0.260476
H  2.397793 -0.881042 -0.673591
H  -0.091109 -1.02342 1.088455
H  0.947531 -2.369919 0.714529
H  2.974612 -1.200372 1.723916
H  1.855635 0.0567 2.183364
H  -0.995177 -2.466853 -0.728355
H  0.438071 -2.19205 -1.69164
H  4.116232 0.936716 2.241908
H  3.172609 1.769662 1.029319
H  -1.381052 -0.841845 -2.532756
H  -0.116659 0.19945 -1.943597
H  4.276127 0.478427 -0.773845
H  5.421124 1.346829 0.211817
H  4.838806 -1.658521 0.406637
H  6.295126 -0.908077 -0.224854
H  5.916457 -0.784487 1.489472
H  -4.833284 0.49861 0.589577
H  -3.220603 2.327945 1.541231
elementType: S O N C H
totalener: -958.85480011 hartree
nucrepener: 1021.01180758 hartree
electener: -1979.86660769 hartree
oneelecener: -3336.21153077 hartree
twoeener: 1356.34492308 hartree
cpcmener: -0.02641339 hartree
kineticenergy: 955.51834800 hartree
xcener: -75.350084342315 hartree
chargesum: 0.0000000
charge: 0.112622 -0.594907 -0.048337 -0.130779 -0.158205 -0.134177 -0.109808 -0.144710 -0.126627 -0.112743 -0.277825 0.348829 -0.283164 -0.053033 0.056231 0.076064 0.074365 0.083979 0.074864 0.073358 0.084915 0.079702 0.076547 0.067352 0.111498 0.127937 0.060612 0.072244 0.077172 0.094251 0.082345 0.161768 0.177660
qa: 0.1126 -0.5949 -0.0483 -0.1308 -0.1582 -0.1342 -0.1098 -0.1447 -0.1266 -0.1127 -0.2778 0.3488 -0.2832 -0.0530 0.0562 0.0761 0.0744 0.0840 0.0749 0.0734 0.0849 0.0797 0.0765 0.0674 0.1115 0.1279 0.0606 0.0722 0.0772 0.0943 0.0823 0.1618 0.1777
va: 2.5675 1.9038 3.0615 3.8283 3.8888 3.8607 3.8325 3.8975 3.8742 3.8728 3.9295 4.1625 3.9354 3.9890 1.0019 1.0106 1.0059 1.0142 1.0033 1.0143 1.0232 1.0162 1.0073 1.0106 1.0222 0.9912 1.0023 1.0073 0.9978 1.0042 1.0009 0.9979 0.9833
dispcorr: -0.013845466 hartree
energy: -958.868645574684
dipole: 31.51379 -30.10129 1.41250 -5.95694 7.53124 1.57430 4.13195 -3.15907 0.97288
magnitude: 2.32811 au
magnitude: 5.91758 debye
