program: Orca
programVersion: 4.2.1
elementType: S O N C C C C C C C C C C C H H H H H H H H H H H H H H H H H H H
charge: 0
multiplicity: 1
keywords: wb97x-d3
keywords: def2-TZVPP
keywords: def2/J RIJCOSX GRIDX6 NOFINALGRIDX
keywords: grid4 nofinalgrid
keywords: scfconv7
keywords: smallprint printgap noloewdin
keywords: NOSOSCF
formula: C11H19NOS
InChI: InChI=1/C11H19NOS/c1-2-3-4-5-6-7-9-12-11(13)8-10-14-12/h8,10H,2-7,9H2,1H3
33 atoms
S  -1.895425 0.437495 1.211494
O  -2.160286 0.331851 -2.544133
N  -1.952785 -0.252029 -0.335543
C  2.284836 -1.584255 -0.499002
C  0.853103 -1.217018 -0.881326
C  2.647984 -1.326554 0.963115
C  -0.200641 -1.995283 -0.106307
C  2.413617 0.104827 1.443189
C  -1.628639 -1.658637 -0.508564
C  3.142013 1.182876 0.644905
C  4.657141 1.042303 0.668041
C  -2.1305 0.6463 -1.356304
C  -2.283244 1.975378 -0.787058
C  -2.169098 1.992965 0.549899
H  2.971821 -1.033727 -1.148226
H  2.454113 -2.642684 -0.719674
H  0.714506 -1.398505 -1.951294
H  0.702876 -0.142094 -0.739912
H  3.697385 -1.597037 1.110626
H  2.083834 -2.005362 1.609038
H  -0.079481 -1.841811 0.970205
H  -0.065502 -3.067895 -0.270681
H  2.720313 0.174075 2.491755
H  1.340662 0.322878 1.43704
H  -2.338759 -2.260273 0.061189
H  -1.794254 -1.884357 -1.561145
H  2.791323 1.184451 -0.391472
H  2.867647 2.160337 1.050458
H  5.035984 1.02963 1.692239
H  4.992299 0.123489 0.184157
H  5.139391 1.872785 0.150748
H  -2.460915 2.846894 -1.398059
H  -2.238662 2.844872 1.210093
elementType: S O N C H
totalener: -958.85414921 hartree
nucrepener: 1049.16271275 hartree
electener: -2008.01686195 hartree
oneelecener: -3392.71368946 hartree
twoeener: 1384.69682751 hartree
cpcmener: -0.02607525 hartree
kineticenergy: 955.52063355 hartree
xcener: -75.352742126391 hartree
chargesum: 0.0000000
charge: 0.116583 -0.586583 -0.071072 -0.161961 -0.104104 -0.171484 -0.143843 -0.113919 -0.087683 -0.116221 -0.275416 0.326167 -0.267185 -0.055664 0.081198 0.079938 0.086325 0.055067 0.084302 0.082192 0.077407 0.086245 0.079935 0.041723 0.132731 0.102292 0.058813 0.072307 0.081790 0.076356 0.093334 0.162288 0.178143
qa: 0.1166 -0.5866 -0.0711 -0.1620 -0.1041 -0.1715 -0.1438 -0.1139 -0.0877 -0.1162 -0.2754 0.3262 -0.2672 -0.0557 0.0812 0.0799 0.0863 0.0551 0.0843 0.0822 0.0774 0.0862 0.0799 0.0417 0.1327 0.1023 0.0588 0.0723 0.0818 0.0764 0.0933 0.1623 0.1781
va: 2.5519 1.9130 3.0820 3.9049 3.8172 3.8715 3.8486 3.8655 3.8222 3.8822 3.9369 4.1793 3.9125 3.9727 1.0008 1.0096 1.0177 1.0128 1.0013 1.0040 1.0022 1.0211 1.0103 1.0248 1.0002 1.0289 1.0041 1.0075 1.0006 0.9997 1.0047 0.9981 0.9825
dispcorr: -0.015054875 hartree
energy: -958.869204081232
dipole: 27.01625 -26.68456 0.33168 -5.02783 5.12737 0.09954 3.57672 -1.32050 2.25621
magnitude: 2.28263 au
magnitude: 5.80200 debye
