program: Gaussian 09
title: 000058970
version: EM64L-G09RevD.01
frameworkgroup: C1[X(C14H17N3O2)]
method: RPBEPBE
basis: SDD
operation: Freq
keyword: #p
keyword: freq=noraman
keyword: PBEPBE/SDD
title: #p freq=noraman PBEPBE/SDD
converged: YES YES NO NO
title: Mulliken charges:
elementType: O O N N N C C C C C C C C C C C C C C H H H H H H H H H H H H H H H H H
charge: -0.220943 -0.228673 -0.088218 -0.415251 0.019376 -0.365782 -0.359855 -0.398756 -0.391808 -0.400171 -0.457587 0.379164 0.077731 0.312877 -0.403679 -0.400321 -0.512281 0.416989 -0.397314 0.228117 0.177721 0.168228 0.212301 0.201243 0.196021 0.194487 0.202744 0.191372 0.216068 0.225512 0.195238 0.293338 0.318369 0.243536 0.289406 0.280800
chargesum: 0.00000
title: Mulliken charges with hydrogens summed into heavy atoms:
elementType: O O N N N C C C C C C C C C C C C C C
charge: -0.220943 -0.228673 -0.088218 -0.096882 0.019376 0.040057 0.020673 -0.001491 0.005423 0.007269 -0.036837 0.379164 0.077731 0.312877 -0.110341 -0.156786 -0.222874 0.416989 -0.116515
polarizability: 3.02127491e+02 -1.45983106e+01 1.74273571e+02 2.01429257e+01 -4.36448227e+00 1.09909795e+02
1716.lowfreq: -5.2051 -0.0007 -0.0004 -0.0002 4.2698 12.6735 19.3607 45.6421 52.7707
frequency: 19.1875 45.6185 52.6582 71.9720 90.1166 120.6500 184.5706 193.2162 208.1006 243.8860 255.7936 291.0761 310.8244 337.4764 363.0217 389.3623 410.7662 424.0277 446.9487 465.3718 529.2735 544.1890 556.6544 573.0997 586.6070 610.2798 651.1416 699.6993 730.2865 752.6429 760.6114 778.7477 798.8090 807.0037 834.7109 844.8157 853.6207 856.2360 904.6369 912.7922 916.8652 959.1117 978.6491 982.3258 992.9870 1038.7149 1052.4164 1060.8305 1082.2737 1096.6592 1111.0896 1121.3648 1136.3827 1150.3977 1154.8372 1191.8921 1204.1185 1228.9249 1241.2224 1254.2790 1264.8418 1270.8651 1285.0949 1292.3035 1318.6937 1332.5592 1340.4643 1343.9651 1350.1099 1355.9197 1367.0240 1383.7901 1409.7467 1421.3961 1452.6082 1460.0292 1460.7089 1466.8531 1472.7989 1476.7841 1481.5227 1484.1152 1551.4553 1580.3724 1632.7574 2823.6652 2829.3114 2843.9713 2968.5043 2983.8173 2984.7147 2985.9985 3020.4107 3033.5135 3038.3812 3045.4374 3054.7723 3149.4485 3173.6165 3188.2969 3236.7890 3609.5627
redmass: 4.9830 4.1267 4.6508 6.3969 5.8558 4.2343 3.2422 4.2760 6.1805 2.0532 4.4476 2.5070 2.3000 5.1887 6.7988 1.8172 4.5581 2.8892 2.8794 3.4146 3.9980 1.3120 2.8147 4.8519 3.2904 2.7844 6.1786 6.0532 6.3972 3.9023 4.2649 4.5856 4.2714 1.6040 1.5635 1.4071 2.6422 1.4079 2.2627 1.4808 4.1652 1.2956 1.3760 2.0967 2.2885 2.9094 2.3384 1.9843 1.4056 1.4976 2.3539 2.7090 1.4329 1.4078 1.9834 1.2908 5.5245 1.7496 2.8304 1.4023 1.2769 1.4748 2.0124 1.3755 1.6752 1.3241 1.4146 1.6556 1.5848 5.0083 1.4863 1.6407 4.8241 2.3995 1.0912 1.0882 1.0950 1.0929 1.1435 4.0811 1.1643 3.4972 6.3649 7.5025 7.0681 1.0711 1.0715 1.0698 1.0627 1.0801 1.0647 1.0638 1.0874 1.0928 1.0907 1.1031 1.1038 1.0900 1.0929 1.0947 1.0986 1.0812
irintensity: 1.2680 0.9005 0.0907 0.2529 0.8611 1.5727 1.5338 0.2617 1.7489 2.3858 11.8547 2.2740 3.5920 0.7542 1.5762 2.9776 3.0383 8.5583 0.7236 0.4936 3.7261 94.9078 4.6437 1.1337 7.8739 5.0767 3.1623 23.6946 19.4729 6.2331 2.6043 1.0188 1.9471 0.3226 14.2730 36.8413 12.0015 6.5752 2.1018 34.8040 6.0907 4.1416 0.3714 13.3360 39.3461 27.2407 40.7043 4.5461 3.2302 41.5844 18.4724 5.7964 19.1130 9.3687 27.6798 1.5278 471.1768 10.3789 109.2526 37.9933 3.4513 20.1414 35.9774 4.5795 28.5634 1.6190 0.5110 8.8977 11.9836 97.5411 4.7014 13.4978 77.0988 29.7075 7.2588 11.4022 12.1395 5.5892 3.3279 20.3547 2.7443 26.1189 23.4404 8.5972 38.9466 45.7260 39.6607 173.3778 39.5409 43.6166 17.3626 21.3381 65.4280 82.4797 21.4793 20.9768 91.5218 7.5684 1.6747 3.3208 0.2864 73.7964
temp: 298.150 k
press: 1.00000 atm
elementType: 8 8 7 7 7 6 6 6 6 6 6 6 6 6 6 6 6 6 6 1 1 1 1 1 1 1 1 1 1 1 1 1 1 1 1 1
symmnumber: 1
zpe: 769754.1 jmol-1
zpe.correction: 0.293184 hartree
zpe.thermalcorrener: 0.309442 hartree
zpe.thermalcorrenthalpy: 0.310386 hartree
zpe.thermalcorrgfe: 0.248041 hartree
zpe.sumelectzpe: -856.915337 hartree
zpe.sumelectthermal: -856.899080 hartree
zpe.sumelectthermalent: -856.898135 hartree
zpe.sumelectthermalfe: -856.960481 hartree
dipole: -7.7487 1.7337 -0.9242
dipole: 7.9939
quadrupole: -153.2536 -99.0701 -113.1034
quadrupole: 5.4744 -4.5499 -0.7127
quadrupole: -31.4445 22.7389 8.7056 5.4744 -4.5499 -0.7127
hfenergy: -857.2085212 hartree
pointgroup: C01 [X(C14H17N3O2)]
dipole: -3.0653082 -0.7036359 -0.0026858 debye
polarizability: 303.6665801|17.1763533|169.0637064|-6.5158901|17.8439442|113.5805717 unknown
InChI: InChI=1S/C14H17N3O2/c18-17(19)12-4-5-13-11(9-15-14(13)8-12)10-16-6-2-1-3-7-16/h4-5,8-9,15H,1-3,6-7,10H2
charge 0 multiplicity 1
36 atoms
O  5.656778 1.308267 0.190482
O  5.665455 -0.896163 -0.399971
N  -3.043707 0.16396 0.289187
N  0.607277 -2.114014 -0.145907
N  5.051376 0.187432 -0.039275
C  -3.110755 0.513919 -1.155277
C  -4.224864 0.683536 1.026748
C  -4.383523 -0.063101 -1.806063
C  -5.532532 0.107104 0.447525
C  -5.648397 0.42258 -1.06145
C  -1.765091 0.591537 0.908912
C  -0.60136 -0.276363 0.489376
C  0.79467 0.093239 0.428337
C  1.536489 -1.081752 0.025572
C  -0.673521 -1.627675 0.135647
C  1.506462 1.302052 0.671435
C  2.930521 -1.082721 -0.136107
C  3.586495 0.14099 0.116868
C  2.899004 1.326187 0.514945
H  -2.207808 0.115632 -1.652201
H  -3.100644 1.628521 -1.290663
H  -4.269541 1.804734 0.981672
H  -4.123023 0.399791 2.091414
H  -4.334048 -1.168996 -1.771343
H  -4.418339 0.236398 -2.871153
H  -6.395214 0.523841 1.001947
H  -5.534242 -0.989963 0.597719
H  -5.757011 1.518484 -1.199524
H  -6.554966 -0.047313 -1.487329
H  -1.892214 0.5307 2.008776
H  -1.527851 1.664092 0.683553
H  -1.560351 -2.253422 0.06408
H  0.82739 -3.063716 -0.438391
H  0.975723 2.208515 0.980017
H  3.512185 -1.957998 -0.437632
H  3.483173 2.232585 0.690373
