program: Gaussian 09
title: 000059027
version: EM64L-G09RevD.01
frameworkgroup: C1[X(C19H24N4)]
method: RPBEPBE
basis: SDD
operation: Freq
keyword: #pfreq=noraman
keyword: PBEPBE/SDD
title: #p freq=noraman PBEPBE/SDD
converged: YES YES NO NO
title: Mulliken charges:
elementType: N N N N C C C C C C C C C C C C C C C C C C C H H H H H H H H H H H H H H H H H H H H H H H H
charge: -0.057609 -0.065441 -0.097239 -0.096748 0.567840 -0.449880 0.352304 -0.478226 -0.369776 -0.401188 -0.401361 0.339169 -0.398839 -0.399895 -0.111387 -0.114508 -0.237634 -0.237453 -0.245915 -0.594199 -0.632701 -0.632147 -0.593699 0.103164 0.221083 0.264977 0.231124 0.230806 0.238872 0.236410 0.188651 0.190028 0.222374 0.221859 0.226370 0.225347 0.218232 0.223592 0.215796 0.215669 0.291794 0.215744 0.216182 0.291126 0.225331 0.223650 0.218351
chargesum: 0.00000
title: Mulliken charges with hydrogens summed into heavy atoms:
elementType: N N N N C C C C C C C C C C C C C C C C C C C
charge: -0.057609 -0.065441 -0.097239 -0.096748 0.567840 -0.346716 0.352304 -0.257143 -0.104799 -0.170064 -0.170556 0.339169 -0.159966 -0.163485 0.077265 0.075519 -0.015260 -0.015594 -0.019545 0.072971 0.090558 0.090905 0.073633
polarizability: 3.65465561e+02 6.27234220e-01 2.26481872e+02 -7.09672411e+00 1.33416282e+01 2.01295505e+02
1716.lowfreq: -4.9873 -4.0894 -0.0007 -0.0002 0.0000 4.1097 9.1069 19.1025 19.4129
frequency: 8.7150 18.8835 19.3870 30.5808 33.0940 39.7919 49.0446 55.4022 69.2917 72.4875 109.6159 123.2499 125.4540 158.1570 167.7151 186.3196 195.9565 198.5709 216.9787 249.1978 295.4283 323.9317 342.3074 346.5180 368.8784 398.8582 400.9388 404.2506 412.8024 430.3102 435.4567 441.1370 502.8709 556.2709 611.6348 614.5847 634.7554 635.1011 695.2771 701.3317 736.4735 740.4209 772.6433 826.8905 838.3758 844.1755 848.8881 873.5076 878.6070 916.3910 936.9183 946.8291 949.0952 966.8787 971.8138 987.7848 990.1199 990.6999 996.3116 1010.2512 1019.9297 1039.5939 1060.8240 1061.4198 1083.2287 1096.0737 1096.4899 1099.1595 1104.1431 1118.2651 1142.1944 1142.3752 1171.7708 1185.0351 1193.7486 1213.3515 1242.1844 1244.8760 1287.9824 1293.1660 1305.9502 1325.5769 1327.7878 1362.3988 1372.3979 1376.0563 1385.1230 1397.2332 1401.9881 1411.5179 1415.5746 1416.1862 1438.8114 1439.2078 1440.5533 1456.2766 1456.5175 1474.1984 1474.9461 1475.2092 1485.1640 1486.0286 1503.6840 1506.0279 1513.6392 1570.8701 1588.9051 1611.8939 1619.1267 1629.4163 1655.5356 2736.3949 2938.6268 2940.1197 2941.9908 2943.1198 2954.2997 2955.7039 3005.7321 3005.8648 3023.7362 3024.0573 3078.0853 3078.5306 3104.8207 3105.1302 3105.4821 3119.4700 3124.2011 3129.3623 3137.3039 3140.6800 3146.6761 3162.7066 3167.1445
redmass: 4.1604 3.7755 3.4072 2.2354 2.1328 1.6462 2.4506 2.4941 3.6921 4.1891 4.1279 1.0892 1.0535 4.2821 3.8121 3.0597 1.9672 2.4065 3.8287 4.8424 4.6608 3.8237 2.7514 2.7366 3.3861 3.3906 4.0493 2.9581 3.8937 3.4302 3.5947 3.9820 3.4481 2.7633 6.5915 6.5384 4.0495 6.1228 5.8168 1.7456 4.1161 3.6581 2.1106 4.4581 1.4132 1.4982 1.2635 3.8800 3.6994 1.4520 1.5489 1.5366 1.4162 1.4046 1.4237 5.2420 3.6710 1.3996 6.7906 5.0150 3.0640 1.8950 1.3735 1.3747 1.6204 1.2221 1.2214 1.7042 1.7392 1.3954 1.3646 1.3644 1.0522 1.1331 1.2403 2.0231 3.5516 3.4769 2.9437 1.4405 1.6040 1.2251 1.4439 1.6018 4.0243 1.4567 2.4755 3.0268 2.6082 3.4522 1.1511 1.1524 2.3900 1.1903 1.1764 1.0435 1.0435 1.0833 1.3780 1.5142 1.0465 1.0466 1.1731 1.1673 2.9055 5.8175 6.6455 6.0468 6.4299 5.3115 6.4313 1.0799 1.0748 1.0626 1.0426 1.0530 1.0393 1.0409 1.1010 1.1010 1.1013 1.1013 1.0966 1.0966 1.0972 1.0971 1.0878 1.0842 1.0876 1.0884 1.0932 1.0932 1.0961 1.1015 1.0954
irintensity: 0.1679 3.1076 0.6739 0.0982 0.1267 0.0761 0.4283 1.0836 0.0338 0.0378 0.3497 0.2787 0.2475 5.2270 0.5589 7.2483 0.6532 0.5802 2.7332 0.9548 0.5763 1.1257 5.9256 44.6086 4.2632 4.6215 13.6490 0.6174 7.1125 2.0055 2.6069 2.7875 11.7481 2.4585 1.3555 1.0183 21.5896 2.8832 6.9688 46.8621 23.7458 25.4334 52.3932 22.2100 24.6656 30.0895 0.2471 14.1275 58.2669 1.7902 30.2414 4.0144 8.3790 4.9876 0.3488 3.4902 187.6316 21.6284 11.8346 9.0334 3.1394 3.8938 7.9916 8.7359 8.8592 1.1546 0.1620 102.8919 139.5596 8.4975 0.5336 0.3590 0.0321 0.5782 2.5934 2.6193 3.7690 40.3989 3.5657 17.5308 7.6671 6.7636 6.7747 14.5492 9.7011 185.3886 48.0361 2.9096 2.1322 5.2067 14.3189 33.2606 3.9769 48.1561 17.2064 5.6343 12.3374 6.0720 26.4752 52.8806 11.4553 34.5601 12.9206 17.7274 1.1302 4.4953 1.7485 34.1644 0.1621 1078.3465 504.1645 102.9139 35.8532 45.6867 71.0510 232.7046 179.8225 102.2567 31.8135 77.8930 29.3974 49.6313 27.2351 30.3291 0.9098 1.1033 22.4979 7.8520 5.5202 12.9299 20.7513 8.0463 49.7705 32.4068 4.5698
temp: 298.150 k
press: 1.00000 atm
elementType: 7 7 7 7 6 6 6 6 6 6 6 6 6 6 6 6 6 6 6 6 6 6 6 1 1 1 1 1 1 1 1 1 1 1 1 1 1 1 1 1 1 1 1 1 1 1 1
symmnumber: 1
zpe: 1022762.1 jmol-1
zpe.correction: 0.389550 hartree
zpe.thermalcorrener: 0.413953 hartree
zpe.thermalcorrenthalpy: 0.414897 hartree
zpe.thermalcorrgfe: 0.329235 hartree
zpe.sumelectzpe: -955.702033 hartree
zpe.sumelectthermal: -955.677630 hartree
zpe.sumelectthermalent: -955.676685 hartree
zpe.sumelectthermalfe: -955.762347 hartree
dipole: 4.0340 -0.0189 -2.2926
dipole: 4.6400
quadrupole: -113.8281 -118.2854 -126.3107
quadrupole: -0.2949 -7.9332 2.7954
quadrupole: 5.6467 1.1893 -6.8360 -0.2949 -7.9332 2.7954
hfenergy: -956.0915826 hartree
pointgroup: C01 [X(C19H24N4)]
dipole: 1.5612633 0.2719666 0.9061039 debye
polarizability: 363.5693291|15.642692|230.51527|6.7202298|11.6791593|199.158339 unknown
InChI: InChI=1S/C19H24N4/c1-22(2)14-20-19(21-15-23(3)4)18-12-10-17(11-13-18)16-8-6-5-7-9-16/h5-15,19H,1-4H3
charge 0 multiplicity 1
47 atoms
N  2.641609 -0.923612 -0.114227
N  2.388222 1.456609 -0.404621
N  4.054548 -2.764341 0.381808
N  3.405516 3.60016 -0.404783
C  0.452321 0.115042 0.308872
C  1.969412 0.290606 0.406648
C  -2.385497 -0.233333 0.115413
C  -0.352279 0.087314 1.470395
C  -0.17101 -0.030821 -0.955237
C  -1.750172 -0.085281 1.377633
C  -1.564778 -0.201104 -1.048771
C  -3.86199 -0.418674 0.014086
C  -4.4330 -1.209835 -1.022081
C  -4.745028 0.189159 0.950309
C  3.381611 -1.601059 0.725651
C  2.970581 2.443799 0.225967
C  -5.829796 -1.386148 -1.119244
C  -6.141881 0.011573 0.856963
C  -6.693781 -0.777147 -0.179434
C  4.891519 -3.477828 1.346312
C  3.962326 -3.306967 -0.978267
C  3.230179 3.773773 -1.851084
C  4.0644 4.675267 0.336744
H  2.218457 0.448471 1.498746
H  0.117118 0.190549 2.457416
H  0.45337 0.004334 -1.85293
H  -2.348953 -0.138003 2.294238
H  -2.032195 -0.27946 -2.037281
H  -3.775038 -1.714497 -1.738727
H  -4.334899 0.829962 1.739335
H  3.535508 -1.309889 1.786922
H  3.166631 2.447475 1.319658
H  -6.243645 -2.006947 -1.922227
H  -6.800691 0.497196 1.586124
H  -7.77838 -0.914244 -0.253736
H  4.543776 -4.521982 1.483633
H  4.853796 -2.972082 2.32671
H  5.950288 -3.512288 1.016106
H  3.563951 -4.340968 -0.963259
H  4.956355 -3.320954 -1.468971
H  3.28273 -2.659441 -1.554089
H  4.2097 3.872992 -2.360635
H  2.627796 4.677954 -2.06953
H  2.709092 2.883535 -2.236509
H  3.510156 5.630535 0.235043
H  5.099577 4.841894 -0.026293
H  4.113569 4.420005 1.409504
