program: Orca
programVersion: 4.2.1
elementType: S O N C C C C C C C C C C C H H H H H H H H H H H H H H H H H H H
charge: 0
multiplicity: 1
keywords: wb97x-d3
keywords: def2-TZVPP
keywords: def2/J RIJCOSX GRIDX6 NOFINALGRIDX
keywords: grid4 nofinalgrid
keywords: scfconv7
keywords: smallprint printgap noloewdin
keywords: NOSOSCF
formula: C11H19NOS
InChI: InChI=1/C11H19NOS/c1-2-3-4-5-6-7-9-12-11(13)8-10-14-12/h8,10H,2-7,9H2,1H3
33 atoms
S  -3.329481 -0.194251 -0.386657
O  -0.309754 1.995651 0.120411
N  -1.693727 0.247538 -0.399858
C  2.095818 -2.015946 0.023409
C  0.745991 -2.574546 0.471134
C  2.696264 -1.001647 0.990183
C  -0.349778 -1.532926 0.677174
C  4.103839 -0.550238 0.607313
C  -0.662634 -0.756399 -0.592747
C  4.203787 0.225826 -0.70427
C  3.448149 1.547367 -0.696115
C  -1.442508 1.531436 0.010265
C  -2.710321 2.193826 0.27032
C  -3.770135 1.386515 0.10497
H  2.005178 -1.57809 -0.975003
H  2.792576 -2.852729 -0.087915
H  0.879409 -3.121325 1.40867
H  0.403837 -3.3115 -0.261617
H  2.73153 -1.447485 1.989495
H  2.040578 -0.130295 1.079399
H  -0.068719 -0.831137 1.46606
H  -1.256726 -2.036471 1.023005
H  4.752863 -1.429991 0.550241
H  4.508842 0.071174 1.412304
H  -0.977418 -1.429638 -1.392381
H  0.214627 -0.227508 -0.962721
H  5.259421 0.423401 -0.908786
H  3.853158 -0.391569 -1.535956
H  2.370587 1.413259 -0.587376
H  3.781312 2.185263 0.125625
H  3.610708 2.098934 -1.623271
H  -2.769749 3.227221 0.575694
H  -4.814439 1.628524 0.236725
elementType: S O N C H
totalener: -958.85372816 hartree
nucrepener: 1026.77530347 hartree
electener: -1985.62903162 hartree
oneelecener: -3348.47149085 hartree
twoeener: 1362.84245923 hartree
cpcmener: -0.02356226 hartree
kineticenergy: 955.51601521 hartree
xcener: -75.348915972183 hartree
chargesum: 0.0000000
charge: 0.121620 -0.573907 -0.076824 -0.136833 -0.161822 -0.132985 -0.116801 -0.142901 -0.079544 -0.117756 -0.254081 0.322557 -0.267326 -0.066819 0.067318 0.079653 0.077354 0.080606 0.081279 0.056205 0.084009 0.085431 0.068251 0.075691 0.128116 0.104083 0.071938 0.061117 0.046680 0.082901 0.092737 0.162125 0.177927
qa: 0.1216 -0.5739 -0.0768 -0.1368 -0.1618 -0.1330 -0.1168 -0.1429 -0.0795 -0.1178 -0.2541 0.3226 -0.2673 -0.0668 0.0673 0.0797 0.0774 0.0806 0.0813 0.0562 0.0840 0.0854 0.0683 0.0757 0.1281 0.1041 0.0719 0.0611 0.0467 0.0829 0.0927 0.1621 0.1779
va: 2.5592 1.9400 3.1061 3.8469 3.9352 3.8425 3.8336 3.9023 3.8048 3.8764 3.9220 4.1836 3.9239 3.9921 1.0016 1.0117 1.0081 1.0075 1.0129 1.0125 1.0108 1.0207 1.0113 1.0069 1.0037 1.0064 1.0073 1.0034 1.0137 1.0026 1.0062 0.9977 0.9841
dispcorr: -0.014294649 hartree
energy: -958.868022805996
dipole: 28.04496 -29.81046 -1.76550 -7.45781 6.09744 -1.36037 1.49615 -1.64530 -0.14915
magnitude: 2.23380 au
magnitude: 5.67787 debye
