program: Orca
programVersion: 4.2.1
elementType: S O N C C C C C C C C C C C H H H H H H H H H H H H H H H H H H H
charge: 0
multiplicity: 1
keywords: wb97x-d3
keywords: def2-TZVPP
keywords: def2/J RIJCOSX GRIDX6 NOFINALGRIDX
keywords: grid4 nofinalgrid
keywords: scfconv7
keywords: smallprint printgap noloewdin
keywords: NOSOSCF
formula: C11H19NOS
InChI: InChI=1/C11H19NOS/c1-2-3-4-5-6-7-9-12-11(13)8-10-14-12/h8,10H,2-7,9H2,1H3
33 atoms
S  -2.448318 0.372437 0.948791
O  -0.433472 0.500937 -2.232183
N  -1.705544 -0.212312 -0.459109
C  1.582628 -1.980059 -0.481993
C  0.603748 -1.749525 0.662717
C  2.951327 -1.328314 -0.291696
C  -0.780683 -2.341997 0.426919
C  2.925811 0.206201 -0.269603
C  -1.588605 -1.647261 -0.664481
C  2.892375 0.831742 1.121842
C  2.729383 2.342825 1.073156
C  -1.0481 0.741694 -1.195056
C  -1.218578 2.032395 -0.548837
C  -1.934776 1.964266 0.584324
H  1.156504 -1.610944 -1.419365
H  1.715953 -3.058823 -0.613833
H  0.501962 -0.679662 0.866928
H  1.017639 -2.183991 1.577347
H  3.594723 -1.664836 -1.108303
H  3.41722 -1.70492 0.625709
H  -1.34782 -2.32521 1.361932
H  -0.700453 -3.395899 0.146673
H  2.066688 0.561339 -0.850031
H  3.80758 0.593788 -0.788285
H  -2.587432 -2.081968 -0.726318
H  -1.130627 -1.779227 -1.642632
H  2.082115 0.401285 1.715118
H  3.816427 0.57674 1.649441
H  2.741724 2.782964 2.071107
H  3.52959 2.81171 0.496867
H  1.782239 2.619313 0.604186
H  -0.801927 2.940316 -0.956962
H  -2.207709 2.77387 1.24487
elementType: S O N C H
totalener: -958.85192170 hartree
nucrepener: 1072.59686712 hartree
electener: -2031.44878882 hartree
oneelecener: -3440.01599059 hartree
twoeener: 1408.56720177 hartree
cpcmener: -0.02425024 hartree
kineticenergy: 955.51654327 hartree
xcener: -75.349007780536 hartree
chargesum: -0.0000000
charge: 0.118310 -0.574202 -0.063616 -0.133675 -0.090070 -0.140139 -0.155806 -0.129299 -0.098769 -0.114460 -0.271150 0.311708 -0.282441 -0.043742 0.061923 0.073292 0.028781 0.093251 0.082876 0.061989 0.092249 0.080529 0.045016 0.085990 0.134614 0.106419 0.068381 0.065514 0.092570 0.081425 0.070145 0.164564 0.177822
qa: 0.1183 -0.5742 -0.0636 -0.1337 -0.0901 -0.1401 -0.1558 -0.1293 -0.0988 -0.1145 -0.2712 0.3117 -0.2824 -0.0437 0.0619 0.0733 0.0288 0.0933 0.0829 0.0620 0.0922 0.0805 0.0450 0.0860 0.1346 0.1064 0.0684 0.0655 0.0926 0.0814 0.0701 0.1646 0.1778
va: 2.5608 1.9229 3.0898 3.8679 3.8365 3.8924 3.9214 3.8352 3.8051 3.8625 3.9390 4.1650 3.9175 3.9743 1.0253 1.0138 1.0209 1.0088 1.0050 1.0087 1.0048 1.0207 1.0232 1.0061 1.0019 1.0202 1.0001 1.0077 1.0041 1.0022 1.0028 0.9976 0.9831
dispcorr: -0.016221750 hartree
energy: -958.868143454444
dipole: 21.22407 -22.22714 -1.00307 -4.27000 4.14596 -0.12404 4.13091 -2.11261 2.01829
magnitude: 2.25722 au
magnitude: 5.73740 debye
