program: Orca
programVersion: 4.2.1
elementType: S O N C C C C C C C C C C C H H H H H H H H H H H H H H H H H H H
charge: 0
multiplicity: 1
keywords: wb97x-d3
keywords: def2-TZVPP
keywords: def2/J RIJCOSX GRIDX6 NOFINALGRIDX
keywords: grid4 nofinalgrid
keywords: scfconv7
keywords: smallprint printgap noloewdin
keywords: NOSOSCF
formula: C11H19NOS
InChI: InChI=1/C11H19NOS/c1-2-3-4-5-6-7-9-12-11(13)8-10-14-12/h8,10H,2-7,9H2,1H3
33 atoms
S  -0.962611 1.002429 -1.378437
O  -3.209946 -0.515521 1.236759
N  -1.838214 -0.207863 -0.576212
C  1.819759 -2.115904 0.767851
C  0.303104 -1.97808 0.654611
C  2.619014 -0.947826 0.188901
C  -0.205117 -2.059508 -0.780196
C  2.377039 0.381351 0.895808
C  -1.645941 -1.600951 -0.947849
C  3.153755 1.552539 0.301055
C  4.66597 1.42298 0.414121
C  -2.547016 0.22642 0.514614
C  -2.372193 1.663769 0.643323
C  -1.557097 2.181421 -0.288806
H  2.132272 -3.04138 0.274072
H  2.086287 -2.233598 1.822503
H  -0.009285 -1.036848 1.115034
H  -0.176602 -2.765378 1.242399
H  2.402144 -0.830657 -0.87825
H  3.680216 -1.20519 0.245538
H  -0.146167 -3.091268 -1.135411
H  0.435248 -1.481849 -1.453281
H  2.62971 0.278736 1.957317
H  1.312392 0.629367 0.860057
H  -2.314919 -2.183028 -0.315491
H  -1.975955 -1.744551 -1.977992
H  2.872694 1.672345 -0.750063
H  2.838522 2.471832 0.801931
H  5.051092 0.574276 -0.152385
H  5.167277 2.315244 0.036367
H  4.973673 1.290459 1.453602
H  -2.851982 2.234818 1.423288
H  -1.263255 3.213231 -0.413107
elementType: S O N C H
totalener: -958.85378337 hartree
nucrepener: 1052.14534394 hartree
electener: -2010.99912731 hartree
oneelecener: -3398.59356690 hartree
twoeener: 1387.59443959 hartree
cpcmener: -0.02622604 hartree
kineticenergy: 955.52047834 hartree
xcener: -75.351038849552 hartree
chargesum: -0.0000000
charge: 0.114314 -0.588573 -0.065700 -0.154694 -0.147878 -0.130896 -0.132473 -0.120825 -0.087675 -0.107970 -0.276871 0.319886 -0.261374 -0.059889 0.076228 0.076843 0.072658 0.091686 0.064429 0.082691 0.091077 0.076609 0.071809 0.052585 0.100675 0.133187 0.049874 0.070272 0.079066 0.091571 0.080147 0.161910 0.177302
qa: 0.1143 -0.5886 -0.0657 -0.1547 -0.1479 -0.1309 -0.1325 -0.1208 -0.0877 -0.1080 -0.2769 0.3199 -0.2614 -0.0599 0.0762 0.0768 0.0727 0.0917 0.0644 0.0827 0.0911 0.0766 0.0718 0.0526 0.1007 0.1332 0.0499 0.0703 0.0791 0.0916 0.0801 0.1619 0.1773
va: 2.5524 1.9102 3.0836 3.9266 3.8528 3.8457 3.8581 3.8741 3.8214 3.8846 3.9384 4.1877 3.9051 3.9763 1.0067 1.0072 1.0044 1.0127 1.0082 1.0098 1.0190 1.0052 1.0126 1.0127 1.0295 0.9996 1.0122 1.0059 0.9983 1.0045 1.0001 0.9980 0.9837
dispcorr: -0.015063504 hartree
energy: -958.868846871470
dipole: 25.27926 -23.76675 1.51251 -4.72520 5.63035 0.90516 3.94587 -5.41960 -1.47373
magnitude: 2.29758 au
magnitude: 5.83999 debye
