program: Orca
programVersion: 4.2.1
elementType: S O N C C C C C C C C C C C H H H H H H H H H H H H H H H H H H H
charge: 0
multiplicity: 1
keywords: wb97x-d3
keywords: def2-TZVPP
keywords: def2/J RIJCOSX GRIDX6 NOFINALGRIDX
keywords: grid4 nofinalgrid
keywords: scfconv7
keywords: smallprint printgap noloewdin
keywords: NOSOSCF
formula: C11H19NOS
InChI: InChI=1/C11H19NOS/c1-2-3-4-5-6-7-9-12-11(13)8-10-14-12/h8,10H,2-7,9H2,1H3
33 atoms
S  -3.281686 -0.551186 0.406742
O  -0.716106 1.647049 -1.258833
N  -1.962487 -0.157559 -0.578133
C  1.587758 -0.75362 0.191735
C  0.387661 -1.461042 0.809037
C  2.516228 -0.15981 1.244991
C  -0.522944 -2.149539 -0.199835
C  3.635594 0.704783 0.675532
C  -1.188086 -1.216268 -1.203655
C  4.626533 -0.04446 -0.207435
C  5.763499 0.843736 -0.688873
C  -1.646023 1.177539 -0.606122
C  -2.591209 1.897998 0.230131
C  -3.496148 1.097781 0.814467
H  1.250716 0.047841 -0.471864
H  2.134094 -1.462232 -0.438766
H  -0.190039 -0.746722 1.406262
H  0.742316 -2.216131 1.516876
H  2.947866 -0.966087 1.847941
H  1.921515 0.446828 1.93553
H  -1.28825 -2.724186 0.330511
H  0.047251 -2.881907 -0.778052
H  4.182204 1.167331 1.503597
H  3.198037 1.532165 0.105334
H  -1.835884 -1.785574 -1.872619
H  -0.449246 -0.723092 -1.832463
H  5.034625 -0.894386 0.349051
H  4.11147 -0.468904 -1.07352
H  6.329706 1.254133 0.149682
H  6.463839 0.29545 -1.320404
H  5.387108 1.686575 -1.272137
H  -2.547688 2.969146 0.354483
H  -4.30329 1.380335 1.474168
elementType: S O N C H
totalener: -958.85549410 hartree
nucrepener: 1019.46640513 hartree
electener: -1978.32189924 hartree
oneelecener: -3333.80410371 hartree
twoeener: 1355.48220447 hartree
cpcmener: -0.02447439 hartree
kineticenergy: 955.52586917 hartree
xcener: -75.349756282376 hartree
chargesum: -0.0000000
charge: 0.118931 -0.580041 -0.061581 -0.131650 -0.104512 -0.127705 -0.153980 -0.132425 -0.105805 -0.077506 -0.288763 0.322525 -0.267224 -0.061799 0.053596 0.072437 0.057901 0.082467 0.066105 0.070716 0.089729 0.082252 0.071018 0.058465 0.136967 0.107548 0.056997 0.057198 0.078775 0.090963 0.079296 0.161407 0.177698
qa: 0.1189 -0.5800 -0.0616 -0.1316 -0.1045 -0.1277 -0.1540 -0.1324 -0.1058 -0.0775 -0.2888 0.3225 -0.2672 -0.0618 0.0536 0.0724 0.0579 0.0825 0.0661 0.0707 0.0897 0.0823 0.0710 0.0585 0.1370 0.1075 0.0570 0.0572 0.0788 0.0910 0.0793 0.1614 0.1777
va: 2.5661 1.9240 3.0846 3.8352 3.8603 3.8922 3.8962 3.8926 3.8108 3.8496 3.9495 4.1722 3.9238 3.9956 1.0267 1.0092 1.0143 1.0117 1.0099 1.0095 1.0058 1.0191 1.0099 1.0096 1.0007 1.0179 1.0064 1.0074 1.0010 1.0033 0.9998 0.9981 0.9838
dispcorr: -0.013551538 hartree
energy: -958.869045642482
dipole: 31.31007 -32.77127 -1.46121 -3.93040 2.58284 -1.34756 1.80662 -0.67683 1.12980
magnitude: 2.28637 au
magnitude: 5.81148 debye
