program: Orca
programVersion: 4.2.1
elementType: S O N C C C C C C C C C C C H H H H H H H H H H H H H H H H H H H
charge: 0
multiplicity: 1
keywords: wb97x-d3
keywords: def2-TZVPP
keywords: def2/J RIJCOSX GRIDX6 NOFINALGRIDX
keywords: grid4 nofinalgrid
keywords: scfconv7
keywords: smallprint printgap noloewdin
keywords: NOSOSCF
formula: C11H19NOS
InChI: InChI=1/C11H19NOS/c1-2-3-4-5-6-7-9-12-11(13)8-10-14-12/h8,10H,2-7,9H2,1H3
33 atoms
S  -3.415678 -0.517324 0.796347
O  -2.543488 1.479412 -2.274957
N  -2.525601 -0.04702 -0.567259
C  2.325566 -0.072756 0.731858
C  1.239163 -0.592179 -0.200438
C  3.700438 -0.657467 0.432309
C  -0.128517 0.012729 0.086459
C  4.773284 -0.163659 1.395654
C  -1.202809 -0.597787 -0.800899
C  6.156558 -0.765228 1.165158
C  6.769043 -0.418899 -0.184916
C  -3.078034 0.981494 -1.286141
C  -4.351079 1.340735 -0.683553
C  -4.631741 0.629089 0.419583
H  2.05095 -0.300836 1.767273
H  2.373999 1.019217 0.664128
H  1.180003 -1.682104 -0.112525
H  1.517944 -0.384776 -1.238743
H  3.974629 -0.410064 -0.597845
H  3.648233 -1.751001 0.478642
H  -0.100083 1.094648 -0.070052
H  -0.387364 -0.147061 1.137969
H  4.457419 -0.39015 2.418973
H  4.839836 0.928227 1.335439
H  -1.24759 -1.679481 -0.660392
H  -0.973957 -0.431274 -1.853222
H  6.825578 -0.417859 1.95699
H  6.101622 -1.852836 1.272967
H  7.780402 -0.818366 -0.272145
H  6.190976 -0.824882 -1.016001
H  6.831299 0.662333 -0.325303
H  -4.985748 2.111443 -1.093578
H  -5.504732 0.702823 1.051201
elementType: S O N C H
totalener: -958.85751176 hartree
nucrepener: 956.11625222 hartree
electener: -1914.97376398 hartree
oneelecener: -3206.60635656 hartree
twoeener: 1291.63259258 hartree
cpcmener: -0.02624113 hartree
kineticenergy: 955.51385482 hartree
xcener: -75.344743566359 hartree
chargesum: 0.0000000
charge: 0.122612 -0.593199 -0.077276 -0.117270 -0.130418 -0.115535 -0.078938 -0.114861 -0.082838 -0.113143 -0.279860 0.341217 -0.276079 -0.064710 0.061035 0.060457 0.064080 0.069355 0.062313 0.058346 0.075797 0.063335 0.066894 0.061179 0.122717 0.097594 0.070094 0.054544 0.091992 0.079316 0.080616 0.163215 0.177416
qa: 0.1226 -0.5932 -0.0773 -0.1173 -0.1304 -0.1155 -0.0789 -0.1149 -0.0828 -0.1131 -0.2799 0.3412 -0.2761 -0.0647 0.0610 0.0605 0.0641 0.0694 0.0623 0.0583 0.0758 0.0633 0.0669 0.0612 0.1227 0.0976 0.0701 0.0545 0.0920 0.0793 0.0806 0.1632 0.1774
va: 2.5579 1.9063 3.1061 3.8950 3.9076 3.8722 3.8376 3.8802 3.8046 3.8978 3.9274 4.1717 3.9239 3.9906 1.0098 1.0097 1.0110 1.0102 1.0074 1.0089 1.0186 1.0215 1.0116 1.0078 1.0026 1.0272 1.0067 1.0080 1.0044 0.9986 0.9998 0.9971 0.9841
dispcorr: -0.011515957 hartree
energy: -958.869027720233
dipole: 42.00341 -42.46102 -0.45761 -4.09958 2.97165 -1.12793 4.56939 -2.60498 1.96440
magnitude: 2.31096 au
magnitude: 5.87398 debye
