program: Orca
programVersion: 4.2.1
elementType: S O N C C C C C C C C C C C H H H H H H H H H H H H H H H H H H H
charge: 0
multiplicity: 1
keywords: wb97x-d3
keywords: def2-TZVPP
keywords: def2/J RIJCOSX GRIDX6 NOFINALGRIDX
keywords: grid4 nofinalgrid
keywords: scfconv7
keywords: smallprint printgap noloewdin
keywords: NOSOSCF
formula: C11H19NOS
InChI: InChI=1/C11H19NOS/c1-2-3-4-5-6-7-9-12-11(13)8-10-14-12/h8,10H,2-7,9H2,1H3
33 atoms
S  -3.308558 0.039527 1.013056
O  -2.48381 0.743374 -2.592268
N  -2.508063 -0.118807 -0.469827
C  2.400214 -0.551777 0.48085
C  1.14893 -1.173388 -0.125267
C  3.629223 -1.442484 0.342031
C  -0.073827 -0.274425 -0.002993
C  4.871088 -0.911435 1.051641
C  -1.315554 -0.942531 -0.570783
C  5.404153 0.402275 0.492439
C  6.697812 0.838205 1.163811
C  -2.977449 0.695941 -1.466349
C  -4.112888 1.446839 -0.957874
C  -4.376788 1.191426 0.334025
H  2.222693 -0.343819 1.541853
H  2.582296 0.417607 0.0072
H  0.946123 -2.131664 0.364604
H  1.328807 -1.40201 -1.181019
H  3.852911 -1.589428 -0.720236
H  3.393177 -2.434408 0.73997
H  0.102378 0.669035 -0.527193
H  -0.239262 -0.024571 1.049712
H  5.662001 -1.66592 0.991515
H  4.653514 -0.788599 2.118519
H  -1.507788 -1.891951 -0.067482
H  -1.180848 -1.173206 -1.627184
H  5.568402 0.295955 -0.584621
H  4.656321 1.191243 0.608439
H  7.064059 1.782037 0.757683
H  6.560119 0.975736 2.238203
H  7.485494 0.094495 1.028087
H  -4.66764 2.14086 -1.570697
H  -5.157667 1.617091 0.946901
elementType: S O N C H
totalener: -958.85759681 hartree
nucrepener: 959.88634785 hartree
electener: -1918.74394467 hartree
oneelecener: -3214.13567302 hartree
twoeener: 1295.39172835 hartree
cpcmener: -0.02637212 hartree
kineticenergy: 955.52041566 hartree
xcener: -75.346043575287 hartree
chargesum: 0.0000000
charge: 0.123851 -0.595374 -0.076326 -0.115225 -0.144259 -0.121241 -0.072987 -0.135279 -0.085921 -0.078202 -0.286881 0.341345 -0.275526 -0.065811 0.062516 0.063918 0.066124 0.069664 0.063056 0.069940 0.075568 0.064293 0.069575 0.059760 0.123485 0.098399 0.056564 0.057213 0.090269 0.078131 0.078953 0.162649 0.177758
qa: 0.1239 -0.5954 -0.0763 -0.1152 -0.1443 -0.1212 -0.0730 -0.1353 -0.0859 -0.0782 -0.2869 0.3413 -0.2755 -0.0658 0.0625 0.0639 0.0661 0.0697 0.0631 0.0699 0.0756 0.0643 0.0696 0.0598 0.1235 0.0984 0.0566 0.0572 0.0903 0.0781 0.0790 0.1626 0.1778
va: 2.5617 1.9038 3.1076 3.8733 3.9210 3.8942 3.8306 3.8965 3.8037 3.8523 3.9497 4.1719 3.9235 3.9900 1.0078 1.0079 1.0118 1.0093 1.0091 1.0107 1.0195 1.0218 1.0099 1.0080 1.0026 1.0272 1.0063 1.0073 1.0034 1.0000 1.0010 0.9973 0.9840
dispcorr: -0.011553426 hartree
energy: -958.869150240508
dipole: 40.82597 -41.25804 -0.43208 -3.86664 3.53013 -0.33651 5.70828 -3.49522 2.21306
magnitude: 2.27981 au
magnitude: 5.79483 debye
