program: Orca
programVersion: 4.2.1
elementType: S O N C C C C C C C C C C C H H H H H H H H H H H H H H H H H H H
charge: 0
multiplicity: 1
keywords: wb97x-d3
keywords: def2-TZVPP
keywords: def2/J RIJCOSX GRIDX6 NOFINALGRIDX
keywords: grid4 nofinalgrid
keywords: scfconv7
keywords: smallprint printgap noloewdin
keywords: NOSOSCF
formula: C11H19NOS
InChI: InChI=1/C11H19NOS/c1-2-3-4-5-6-7-9-12-11(13)8-10-14-12/h8,10H,2-7,9H2,1H3
33 atoms
S  -1.249439 1.38383 -0.636784
O  -3.932484 -1.23059 -0.281495
N  -1.983159 -0.136776 -0.768079
C  1.643339 -0.868425 -0.123166
C  0.452884 -1.389685 0.672247
C  2.698514 -0.207773 0.754356
C  -0.593679 -2.118737 -0.163591
C  3.873246 0.342152 -0.045627
C  -1.247918 -1.291415 -1.261382
C  4.931284 1.048739 0.796632
C  5.676779 0.126873 1.751453
C  -3.262719 -0.19864 -0.284442
C  -3.650787 1.120592 0.183586
C  -2.674032 2.033158 0.053347
H  1.315061 -0.145479 -0.878003
H  2.095954 -1.695238 -0.681225
H  -0.010585 -0.565084 1.222758
H  0.815065 -2.083193 1.436642
H  3.05022 -0.932448 1.495279
H  2.237078 0.607988 1.32218
H  -1.372888 -2.517587 0.490024
H  -0.133417 -2.98265 -0.65185
H  3.490983 1.042821 -0.794716
H  4.344377 -0.472101 -0.607205
H  -1.952678 -1.906403 -1.820375
H  -0.512947 -0.942119 -1.986985
H  5.653263 1.526301 0.128939
H  4.462269 1.860082 1.362003
H  5.015264 -0.31412 2.498326
H  6.156076 -0.693351 1.21277
H  6.457983 0.664519 2.290597
H  -4.628428 1.323886 0.593016
H  -2.704263 3.078192 0.324607
elementType: S O N C H
totalener: -958.85566527 hartree
nucrepener: 1010.61093013 hartree
electener: -1969.46659539 hartree
oneelecener: -3315.43595992 hartree
twoeener: 1345.96936453 hartree
cpcmener: -0.02636683 hartree
kineticenergy: 955.52157665 hartree
xcener: -75.349414565733 hartree
chargesum: -0.0000000
charge: 0.113612 -0.595396 -0.048159 -0.133938 -0.148431 -0.111362 -0.113854 -0.107050 -0.126579 -0.112950 -0.277513 0.349547 -0.284303 -0.054136 0.051702 0.075831 0.073032 0.082295 0.066167 0.055659 0.084483 0.079632 0.067696 0.060375 0.110453 0.128661 0.070600 0.053911 0.078963 0.079220 0.091432 0.162777 0.177624
qa: 0.1136 -0.5954 -0.0482 -0.1339 -0.1484 -0.1114 -0.1139 -0.1071 -0.1266 -0.1129 -0.2775 0.3495 -0.2843 -0.0541 0.0517 0.0758 0.0730 0.0823 0.0662 0.0557 0.0845 0.0796 0.0677 0.0604 0.1105 0.1287 0.0706 0.0539 0.0790 0.0792 0.0914 0.1628 0.1776
va: 2.5673 1.9029 3.0631 3.8647 3.8816 3.8569 3.8385 3.8767 3.8714 3.8983 3.9265 4.1612 3.9349 3.9895 1.0029 1.0134 1.0046 1.0148 1.0102 1.0121 1.0229 1.0154 1.0106 1.0084 1.0230 0.9909 1.0064 1.0082 0.9991 1.0006 1.0042 0.9975 0.9832
dispcorr: -0.013278852 hartree
energy: -958.868944119924
dipole: 31.86204 -30.15495 1.70709 -4.94707 6.52902 1.58195 6.59004 -6.68881 -0.09877
magnitude: 2.32948 au
magnitude: 5.92107 debye
