program: Orca
programVersion: 4.2.1
elementType: S O N C C C C C C C C C C C H H H H H H H H H H H H H H H H H H H
charge: 0
multiplicity: 1
keywords: wb97x-d3
keywords: def2-TZVPP
keywords: def2/J RIJCOSX GRIDX6 NOFINALGRIDX
keywords: grid4 nofinalgrid
keywords: scfconv7
keywords: smallprint printgap noloewdin
keywords: NOSOSCF
formula: C11H19NOS
InChI: InChI=1/C11H19NOS/c1-2-3-4-5-6-7-9-12-11(13)8-10-14-12/h8,10H,2-7,9H2,1H3
33 atoms
S  -1.41648 1.143757 -1.379259
O  -3.563407 -0.697232 1.103465
N  -2.112654 -0.183274 -0.589084
C  1.876625 -1.992172 0.566435
C  0.750695 -1.379145 -0.258197
C  3.241233 -1.355565 0.317768
C  -0.583005 -2.081591 -0.044688
C  3.338412 0.106933 0.735863
C  -1.716997 -1.54814 -0.906541
C  4.735337 0.687127 0.554627
C  4.829747 2.145158 0.976556
C  -2.985164 0.142103 0.41407
C  -3.093143 1.588449 0.491292
C  -2.312739 2.222053 -0.399886
H  1.93851 -3.062173 0.344676
H  1.629215 -1.917244 1.630969
H  1.017475 -1.422724 -1.32031
H  0.654133 -0.319155 -0.010008
H  3.494562 -1.447181 -0.7443
H  4.001337 -1.927969 0.858735
H  -0.872953 -2.031898 1.008522
H  -0.477994 -3.143787 -0.284055
H  3.039834 0.203096 1.785925
H  2.628492 0.712039 0.163112
H  -2.604226 -2.170456 -0.792395
H  -1.447651 -1.586529 -1.963376
H  5.452331 0.093047 1.129519
H  5.033885 0.590279 -0.493778
H  5.837787 2.538546 0.838822
H  4.150864 2.771512 0.394661
H  4.569812 2.27065 2.029418
H  -3.738298 2.083337 1.200689
H  -2.205994 3.286623 -0.546639
elementType: S O N C H
totalener: -958.85664764 hartree
nucrepener: 1003.72012446 hartree
electener: -1962.57677210 hartree
oneelecener: -3301.77023670 hartree
twoeener: 1339.19346459 hartree
cpcmener: -0.02657072 hartree
kineticenergy: 955.51963161 hartree
xcener: -75.347142933582 hartree
chargesum: -0.0000000
charge: 0.122719 -0.596623 -0.070934 -0.141424 -0.123455 -0.129531 -0.093662 -0.106056 -0.101791 -0.086680 -0.278962 0.347062 -0.280778 -0.056556 0.074491 0.065718 0.073914 0.055548 0.062374 0.072167 0.071783 0.077932 0.058197 0.053301 0.110529 0.124064 0.055879 0.054854 0.090600 0.077374 0.077989 0.162322 0.177638
qa: 0.1227 -0.5966 -0.0709 -0.1414 -0.1235 -0.1295 -0.0937 -0.1061 -0.1018 -0.0867 -0.2790 0.3471 -0.2808 -0.0566 0.0745 0.0657 0.0739 0.0555 0.0624 0.0722 0.0718 0.0779 0.0582 0.0533 0.1105 0.1241 0.0559 0.0549 0.0906 0.0774 0.0780 0.1623 0.1776
va: 2.5610 1.9005 3.0915 3.9362 3.8530 3.8941 3.8164 3.8571 3.8637 3.8837 3.9447 4.1668 3.9289 3.9734 1.0118 1.0077 1.0045 1.0103 1.0090 1.0112 1.0211 1.0171 1.0079 1.0084 1.0220 1.0009 1.0076 1.0061 1.0045 1.0008 1.0007 0.9979 0.9833
dispcorr: -0.012608082 hartree
energy: -958.869255723907
dipole: 30.31002 -28.88211 1.42792 -4.31738 5.41780 1.10042 4.97233 -6.40876 -1.43643
magnitude: 2.30504 au
magnitude: 5.85895 debye
