program: Orca
programVersion: 4.2.1
elementType: S O N C C C C C C C C C C C H H H H H H H H H H H H H H H H H H H
charge: 0
multiplicity: 1
keywords: wb97x-d3
keywords: def2-TZVPP
keywords: def2/J RIJCOSX GRIDX6 NOFINALGRIDX
keywords: grid4 nofinalgrid
keywords: scfconv7
keywords: smallprint printgap noloewdin
keywords: NOSOSCF
formula: C11H19NOS
InChI: InChI=1/C11H19NOS/c1-2-3-4-5-6-7-9-12-11(13)8-10-14-12/h8,10H,2-7,9H2,1H3
33 atoms
S  -3.043219 0.731671 1.047118
O  -2.808579 0.002543 -2.640219
N  -2.31391 0.556624 -0.47147
C  2.160241 -1.497702 0.479001
C  1.385152 -0.356573 -0.16904
C  3.662425 -1.461111 0.216182
C  -0.118246 -0.489141 0.03243
C  4.380925 -0.272526 0.84379
C  -0.871379 0.668314 -0.603667
C  5.891087 -0.318676 0.650515
C  6.605116 0.867723 1.279164
C  -3.169026 0.199262 -1.480938
C  -4.515831 0.11341 -0.942606
C  -4.573841 0.365175 0.374927
H  1.759368 -2.447843 0.112602
H  1.981093 -1.490598 1.559714
H  1.608076 -0.331312 -1.241282
H  1.718991 0.603873 0.235059
H  3.841255 -1.466097 -0.8648
H  4.108266 -2.384616 0.599058
H  -0.338486 -0.532649 1.103931
H  -0.470956 -1.429702 -0.399746
H  4.154515 -0.240195 1.915774
H  3.997667 0.663899 0.425921
H  -0.662468 0.717631 -1.671888
H  -0.550701 1.620576 -0.175988
H  6.282104 -1.247783 1.076608
H  6.119078 -0.357348 -0.419241
H  7.684398 0.812987 1.129957
H  6.262205 1.810736 0.848944
H  6.424975 0.914203 2.355003
H  -5.367755 -0.135696 -1.55632
H  -5.44607 0.363513 1.011739
elementType: S O N C H
totalener: -958.85722624 hartree
nucrepener: 961.17049328 hartree
electener: -1920.02771952 hartree
oneelecener: -3216.63071140 hartree
twoeener: 1296.60299189 hartree
cpcmener: -0.02632095 hartree
kineticenergy: 955.52223564 hartree
xcener: -75.346667028792 hartree
chargesum: -0.0000000
charge: 0.121639 -0.594276 -0.071487 -0.127746 -0.137633 -0.132713 -0.091350 -0.107749 -0.077907 -0.087492 -0.280425 0.339007 -0.277188 -0.065490 0.074277 0.065428 0.070406 0.067777 0.062081 0.071361 0.066919 0.077288 0.057185 0.057762 0.095544 0.126876 0.054769 0.055452 0.091221 0.077650 0.078250 0.163179 0.177385
qa: 0.1216 -0.5943 -0.0715 -0.1277 -0.1376 -0.1327 -0.0913 -0.1077 -0.0779 -0.0875 -0.2804 0.3390 -0.2772 -0.0655 0.0743 0.0654 0.0704 0.0678 0.0621 0.0714 0.0669 0.0773 0.0572 0.0578 0.0955 0.1269 0.0548 0.0555 0.0912 0.0776 0.0782 0.1632 0.1774
va: 2.5608 1.9076 3.1044 3.8999 3.8965 3.9001 3.8596 3.8564 3.7891 3.8814 3.9441 4.1760 3.9197 3.9928 1.0105 1.0081 1.0093 1.0100 1.0093 1.0108 1.0184 1.0168 1.0080 1.0077 1.0327 1.0012 1.0077 1.0060 1.0039 1.0010 1.0005 0.9971 0.9842
dispcorr: -0.011510394 hartree
energy: -958.868736630274
dipole: 40.58316 -40.68987 -0.10671 -4.33420 4.63041 0.29621 5.68422 -3.42467 2.25955
magnitude: 2.28138 au
magnitude: 5.79881 debye
