program: Orca
programVersion: 4.2.1
elementType: S O N C C C C C C C C C C C H H H H H H H H H H H H H H H H H H H
charge: 0
multiplicity: 1
keywords: wb97x-d3
keywords: def2-TZVPP
keywords: def2/J RIJCOSX GRIDX6 NOFINALGRIDX
keywords: grid4 nofinalgrid
keywords: scfconv7
keywords: smallprint printgap noloewdin
keywords: NOSOSCF
formula: C11H19NOS
InChI: InChI=1/C11H19NOS/c1-2-3-4-5-6-7-9-12-11(13)8-10-14-12/h8,10H,2-7,9H2,1H3
33 atoms
S  -2.655757 -0.381799 -1.599222
O  -2.423244 1.281486 1.768445
N  -2.348947 -0.238243 0.060263
C  2.014365 -1.480144 -0.287205
C  0.496325 -1.394863 -0.41832
C  2.671778 -0.206365 0.231557
C  -0.226828 -1.238964 0.914117
C  4.192391 -0.291291 0.248024
C  -1.742008 -1.326123 0.813664
C  4.861913 0.975894 0.764095
C  6.379728 0.879934 0.775037
C  -2.611913 0.997735 0.585916
C  -3.133206 1.853174 -0.46577
C  -3.199555 1.238697 -1.65874
H  2.434983 -1.71772 -1.269176
H  2.277336 -2.31913 0.365951
H  0.133423 -2.301637 -0.912831
H  0.247644 -0.562905 -1.084208
H  2.316418 0.017277 1.242213
H  2.362083 0.638544 -0.39367
H  0.045238 -0.299312 1.400014
H  0.088895 -2.0381 1.591658
H  4.554967 -0.505127 -0.763494
H  4.50209 -1.141094 0.866294
H  -2.188451 -1.314518 1.807728
H  -2.043265 -2.267199 0.350482
H  4.553928 1.825082 0.146433
H  4.501547 1.189757 1.774926
H  6.772602 0.700737 -0.227555
H  6.837679 1.797076 1.147779
H  6.720301 0.060871 1.411329
H  -3.428749 2.875329 -0.28632
H  -3.545633 1.648903 -2.595958
elementType: S O N C H
totalener: -958.85659623 hartree
nucrepener: 991.60025597 hartree
electener: -1950.45685220 hartree
oneelecener: -3277.70951297 hartree
twoeener: 1327.25266077 hartree
cpcmener: -0.02674589 hartree
kineticenergy: 955.52104318 hartree
xcener: -75.347134128086 hartree
chargesum: -0.0000000
charge: 0.123857 -0.597009 -0.070536 -0.137190 -0.148073 -0.106259 -0.082582 -0.120308 -0.113161 -0.075479 -0.285335 0.348573 -0.280794 -0.057155 0.072775 0.065784 0.088872 0.060079 0.060130 0.059254 0.068179 0.080717 0.056930 0.057027 0.111307 0.124130 0.054585 0.054591 0.078768 0.090165 0.078204 0.161928 0.178024
qa: 0.1239 -0.5970 -0.0705 -0.1372 -0.1481 -0.1063 -0.0826 -0.1203 -0.1132 -0.0755 -0.2853 0.3486 -0.2808 -0.0572 0.0728 0.0658 0.0889 0.0601 0.0601 0.0593 0.0682 0.0807 0.0569 0.0570 0.1113 0.1241 0.0546 0.0546 0.0788 0.0902 0.0782 0.1619 0.1780
va: 2.5654 1.8993 3.0873 3.9372 3.8929 3.8638 3.7740 3.8895 3.8776 3.8678 3.9461 4.1599 3.9340 3.9767 1.0100 1.0098 1.0053 1.0123 1.0101 1.0091 1.0272 1.0157 1.0091 1.0077 1.0193 1.0008 1.0069 1.0072 1.0003 1.0044 1.0002 0.9984 0.9833
dispcorr: -0.012454050 hartree
energy: -958.869050282248
dipole: 35.11134 -35.14154 -0.03020 -3.56134 2.59494 -0.96640 4.31835 -6.41330 -2.09495
magnitude: 2.30731 au
magnitude: 5.86471 debye
