program: Orca
programVersion: 4.2.1
elementType: S O N C C C C C C C C C C C H H H H H H H H H H H H H H H H H H H
charge: 0
multiplicity: 1
keywords: wb97x-d3
keywords: def2-TZVPP
keywords: def2/J RIJCOSX GRIDX6 NOFINALGRIDX
keywords: grid4 nofinalgrid
keywords: scfconv7
keywords: smallprint printgap noloewdin
keywords: NOSOSCF
formula: C11H19NOS
InChI: InChI=1/C11H19NOS/c1-2-3-4-5-6-7-9-12-11(13)8-10-14-12/h8,10H,2-7,9H2,1H3
33 atoms
S  -3.111975 -0.598465 0.574267
O  -1.245091 1.850104 -1.594922
N  -2.073233 -0.071671 -0.65631
C  1.845421 -1.369935 0.994428
C  0.794812 -0.682689 0.130511
C  2.796889 -0.407009 1.699952
C  -0.180668 -1.674983 -0.485753
C  3.660572 0.453865 0.781199
C  -1.245557 -1.034987 -1.363059
C  4.606069 -0.340816 -0.111012
C  5.539152 0.551925 -0.915082
C  -1.979256 1.290161 -0.783289
C  -2.878122 1.910992 0.176003
C  -3.523162 1.02127 0.946665
H  2.410425 -2.082265 0.385235
H  1.336428 -1.971198 1.754312
H  1.273405 -0.109444 -0.669317
H  0.252021 0.043469 0.745286
H  3.453802 -0.981496 2.360738
H  2.212451 0.248574 2.353367
H  -0.655884 -2.269247 0.301596
H  0.361488 -2.38849 -1.112244
H  4.251732 1.134697 1.402076
H  3.028147 1.096041 0.15981
H  -1.890214 -1.799332 -1.799985
H  -0.787876 -0.496991 -2.192203
H  5.196804 -1.02378 0.508022
H  4.034915 -0.972198 -0.797272
H  4.979854 1.224711 -1.568124
H  6.157638 1.169907 -0.261221
H  6.21066 -0.032782 -1.545308
H  -2.994349 2.981432 0.248198
H  -4.238628 1.219967 1.730886
elementType: S O N C H
totalener: -958.85613923 hartree
nucrepener: 1009.90490430 hartree
electener: -1968.76104353 hartree
oneelecener: -3314.45978669 hartree
twoeener: 1345.69874316 hartree
cpcmener: -0.02617689 hartree
kineticenergy: 955.52255866 hartree
xcener: -75.348764265384 hartree
chargesum: -0.0000000
charge: 0.122075 -0.587850 -0.077620 -0.146167 -0.105451 -0.149699 -0.128180 -0.140124 -0.088931 -0.077521 -0.283962 0.325726 -0.266279 -0.061661 0.071318 0.079773 0.068945 0.063368 0.075494 0.072893 0.073349 0.084245 0.074571 0.065258 0.133459 0.103071 0.058525 0.055509 0.078926 0.077639 0.090561 0.161015 0.177724
qa: 0.1221 -0.5879 -0.0776 -0.1462 -0.1055 -0.1497 -0.1282 -0.1401 -0.0889 -0.0775 -0.2840 0.3257 -0.2663 -0.0617 0.0713 0.0798 0.0689 0.0634 0.0755 0.0729 0.0733 0.0842 0.0746 0.0653 0.1335 0.1031 0.0585 0.0555 0.0789 0.0776 0.0906 0.1610 0.1777
va: 2.5627 1.9108 3.0792 3.8857 3.8046 3.9089 3.8563 3.8690 3.8212 3.8477 3.9479 4.1775 3.9225 3.9945 1.0017 1.0097 1.0146 1.0150 1.0077 1.0086 1.0101 1.0193 1.0085 1.0016 1.0020 1.0269 1.0071 1.0046 1.0001 1.0015 1.0032 0.9981 0.9836
dispcorr: -0.013182332 hartree
energy: -958.869321562430
dipole: 32.55808 -33.57742 -1.01934 -4.73559 3.25141 -1.48419 1.95478 -0.51525 1.43953
magnitude: 2.30524 au
magnitude: 5.85945 debye
