program: Gaussian 09
title: 000059022
version: EM64L-G09RevD.01
frameworkgroup: C1[X(C19H22N2O)]
method: RPBEPBE
basis: SDD
operation: Freq
keyword: #p
keyword: freq=noraman
keyword: PBEPBE/SDD
title: #p freq=noraman PBEPBE/SDD
converged: YES YES NO NO
title: Mulliken charges:
elementType: O N N C C C C C C C C C C C C C C C C C C C H H H H H H H H H H H H H H H H H H H H H H
charge: -0.292565 -0.401546 -0.076194 0.391990 -0.566767 0.137459 -0.357467 0.212455 -0.444269 -0.561013 -0.323901 0.347018 -0.377843 -0.615847 -0.621162 -0.394462 0.406826 -0.398625 -0.404131 -0.218836 -0.227101 -0.241557 0.225684 0.212256 0.224684 0.191814 0.269010 0.302371 0.253255 0.227664 0.246253 0.220598 0.186039 0.226706 0.231271 0.180781 0.222281 0.219409 0.216890 0.267661 0.225831 0.224992 0.224870 0.227218
chargesum: 0.00000
title: Mulliken charges with hydrogens summed into heavy atoms:
elementType: O N N C C C C C C C C C C C C C C C C C C C
charge: -0.292565 -0.099175 -0.076194 0.391990 -0.128827 0.137459 0.059030 0.212455 -0.175259 -0.307758 -0.096236 0.347018 -0.131590 0.017495 0.013172 0.041836 0.406826 -0.130964 -0.178300 0.006157 -0.002231 -0.014339
polarizability: 3.07530794e+02 -1.12169829e+01 2.47567069e+02 -7.69484012e+00 -6.15899277e+00 1.20593414e+02
1716.lowfreq: -9.4809 -5.1083 -0.0005 -0.0003 0.0005 2.9124 6.2840 18.7506 20.2185
frequency: 4.6526 18.5519 20.1530 33.4414 55.1143 59.6826 93.0657 101.8889 142.4908 152.3175 176.2290 199.8686 222.6970 227.2728 234.6611 246.2245 279.3996 306.0953 336.2224 372.1134 401.9105 418.2317 425.2005 430.8049 447.6810 469.9883 482.7674 489.7408 506.1708 576.7927 593.4680 608.5055 617.2070 648.4743 702.1078 710.3250 740.7016 747.6365 755.2895 783.5315 792.7423 804.8338 811.8863 824.6234 835.9483 843.8641 856.0990 911.5751 920.5232 934.1445 979.3713 989.7896 994.0150 995.7961 1007.2996 1013.5391 1018.9553 1027.6928 1032.9053 1056.6186 1059.5383 1083.9898 1088.4756 1095.3659 1124.8110 1134.3695 1156.3367 1171.4524 1184.5526 1187.4827 1205.1625 1220.0594 1224.5363 1244.5585 1253.0878 1260.9564 1292.7302 1294.2804 1306.3718 1313.9747 1322.2918 1357.5640 1366.3050 1389.7591 1396.2472 1416.3420 1428.5808 1439.5825 1440.4707 1458.7931 1461.0272 1462.1585 1470.4272 1471.5848 1475.7293 1477.6819 1478.7474 1485.8867 1486.5401 1561.2016 1594.6583 1595.8231 1618.7579 1632.9484 2832.7898 2836.2332 2857.4411 2924.0298 2978.0839 2981.6191 3017.1977 3022.8983 3028.2591 3052.4080 3076.3687 3086.0052 3111.6825 3126.5064 3135.9868 3140.3721 3156.5140 3158.2877 3169.1959 3173.9286 3219.4001 3616.7690
redmass: 3.7744 4.2039 2.6425 4.9824 3.8270 4.1903 3.5099 2.3032 3.6020 5.1887 3.3944 2.8772 3.1019 1.4704 1.2989 2.0016 3.8241 3.8501 2.7310 4.0539 2.8416 3.5803 2.9088 3.0511 2.7572 2.9020 5.6773 1.2565 4.2218 4.5662 2.7152 5.2237 6.3471 3.5975 2.3492 4.3906 1.5768 2.9338 3.6999 1.4730 1.4440 1.5323 4.5655 4.0797 2.3703 2.5138 1.2503 1.4030 3.9614 1.3261 1.3786 6.1432 4.4757 1.3495 2.0158 2.4247 1.7478 2.1239 1.6613 2.6227 2.4891 1.5858 1.3018 1.5007 1.3150 1.2463 1.6776 1.0540 1.2452 2.2595 1.2613 1.7683 1.9650 2.7277 1.4513 2.4776 1.2493 1.9488 1.7418 1.5618 1.6613 1.7007 1.3579 4.3672 5.5424 1.1439 2.4786 2.1740 1.1627 1.1400 1.0790 2.0365 2.4744 1.0798 1.0682 1.6967 1.1619 1.0643 2.2020 6.2787 6.4838 6.1574 6.0544 7.1198 1.0647 1.0616 1.0594 1.0568 1.1028 1.0623 1.0719 1.0848 1.0728 1.1000 1.1008 1.1000 1.0874 1.0868 1.0891 1.0930 1.0908 1.0981 1.0956 1.0968 1.0983 1.0809
irintensity: 0.2056 0.1019 0.2042 1.3380 0.8167 0.1653 5.1440 1.5701 0.4819 0.3333 2.4636 1.7816 7.6556 0.6938 1.5922 0.5131 2.4796 3.0107 8.3224 3.0523 0.4740 3.0006 3.9597 1.6691 2.9554 10.0098 2.8130 101.9585 0.2377 3.9825 9.1410 6.4147 0.5276 8.7453 24.2368 30.2069 58.3460 13.3805 3.4052 18.3883 31.4537 22.3429 1.6265 7.6428 36.7807 16.7687 0.2040 3.5320 31.3684 0.0268 0.1047 0.0506 86.4357 0.4562 10.4666 10.5192 2.9957 10.2647 27.0761 44.5298 20.7667 10.8074 6.2042 32.0027 12.8105 1.1003 14.1136 0.8921 64.2388 155.3820 7.4868 7.6949 42.2183 22.2325 3.2280 5.1702 0.7274 40.7462 28.4746 2.1887 6.1324 17.6745 9.6442 10.6020 16.7744 1.5268 25.2549 8.3150 2.1889 33.3409 10.5254 97.6420 52.8788 13.1497 10.0475 41.9260 7.9531 25.5136 14.1951 3.0026 28.3026 3.6048 12.6188 38.6136 58.3057 90.0340 203.0609 23.9847 32.1792 27.6261 49.8347 32.1687 37.1834 34.0757 35.0051 47.5011 10.5874 1.0293 13.8820 32.1148 14.4688 35.3117 8.4718 8.2250 1.3013 67.7268
temp: 298.150 k
press: 1.00000 atm
elementType: 8 7 7 6 6 6 6 6 6 6 6 6 6 6 6 6 6 6 6 6 6 6 1 1 1 1 1 1 1 1 1 1 1 1 1 1 1 1 1 1 1 1 1 1
symmnumber: 1
zpe: 959309.8 jmol-1
zpe.correction: 0.365382 hartree
zpe.thermalcorrener: 0.386250 hartree
zpe.thermalcorrenthalpy: 0.387194 hartree
zpe.thermalcorrgfe: 0.310967 hartree
zpe.sumelectzpe: -920.323994 hartree
zpe.sumelectthermal: -920.303126 hartree
zpe.sumelectthermalent: -920.302181 hartree
zpe.sumelectthermalfe: -920.378409 hartree
dipole: 1.6206 -0.2029 0.2189
dipole: 1.6478
quadrupole: -120.2078 -109.4124 -137.8989
quadrupole: -12.7803 3.7629 -0.5020
quadrupole: 2.2986 13.0940 -15.3925 -12.7803 3.7629 -0.5020
hfenergy: -920.6893755 hartree
pointgroup: C01 [X(C19H22N2O1)]
dipole: -0.6418902 -0.0467345 -0.0780881 debye
polarizability: 308.5966386|6.6285384|246.5725407|-9.1504926|-4.6111821|120.5220978 unknown
InChI: InChI=1S/C19H22N2O/c1-21(2)11-10-16-13-20-19-9-8-17(12-18(16)19)22-14-15-6-4-3-5-7-15/h3-9,12-13,20H,10-11,14H2,1-2H3
charge 0 multiplicity 1
44 atoms
O  1.784414 -1.157406 -0.092131
N  -3.559297 -2.747138 0.292274
N  -3.775105 3.234712 -0.25217
C  -3.24071 -0.498962 0.59815
C  -3.504592 0.967241 0.839993
C  -1.952948 -1.123379 0.34149
C  -3.42818 1.808302 -0.462356
C  -2.182003 -2.529928 0.155067
C  -4.189795 -1.52333 0.560333
C  -0.626642 -0.611486 0.265316
C  -1.12559 -3.431825 -0.107024
C  0.421982 -1.517382 0.009481
C  0.176994 -2.912724 -0.178163
C  -4.068307 3.923661 -1.526294
C  -2.768184 3.969613 0.539436
C  2.120707 0.253319 0.110187
C  3.627575 0.418897 0.027292
C  4.503745 -0.671773 0.242832
C  4.170611 1.701494 -0.235736
C  5.903408 -0.479032 0.20107
C  5.569323 1.895329 -0.270845
C  6.441676 0.803684 -0.051867
H  -4.508865 1.116674 1.27735
H  -2.774908 1.35445 1.578227
H  -4.152164 1.38667 -1.184442
H  -2.411604 1.69131 -0.922231
H  -5.266684 -1.466363 0.710729
H  -4.024395 -3.648919 0.223839
H  -0.445791 0.458256 0.404204
H  -1.302512 -4.503328 -0.250968
H  1.034502 -3.561708 -0.379482
H  -4.407034 4.955624 -1.322107
H  -3.186986 3.981421 -2.216091
H  -4.881403 3.396185 -2.056153
H  -2.649763 3.511572 1.535776
H  -1.760311 3.999333 0.047536
H  -3.105228 5.011148 0.688087
H  1.749982 0.576649 1.10841
H  1.618136 0.878518 -0.658151
H  4.078759 -1.662428 0.42709
H  3.500568 2.552075 -0.416815
H  6.573484 -1.330713 0.365066
H  5.97674 2.891833 -0.475674
H  7.527095 0.951053 -0.083236
