program: Orca
programVersion: 4.2.1
elementType: S O N C C C C C C C C C C C H H H H H H H H H H H H H H H H H H H
charge: 0
multiplicity: 1
keywords: wb97x-d3
keywords: def2-TZVPP
keywords: def2/J RIJCOSX GRIDX6 NOFINALGRIDX
keywords: grid4 nofinalgrid
keywords: scfconv7
keywords: smallprint printgap noloewdin
keywords: NOSOSCF
formula: C11H19NOS
InChI: InChI=1/C11H19NOS/c1-2-3-4-5-6-7-9-12-11(13)8-10-14-12/h8,10H,2-7,9H2,1H3
33 atoms
S  -2.114704 0.809338 1.071183
O  -2.791587 -0.401816 -2.431337
N  -2.213734 -0.29146 -0.213663
C  2.132061 -1.137488 -0.839843
C  0.620284 -0.979427 -0.972657
C  2.731985 -0.458488 0.386624
C  -0.162413 -1.646911 0.150293
C  4.252674 -0.559742 0.420992
C  -1.668572 -1.630029 -0.06139
C  4.895446 0.030679 1.672487
C  4.703359 1.53385 1.817327
C  -2.687778 0.237677 -1.386246
C  -3.034138 1.63177 -1.162434
C  -2.774553 2.045654 0.087471
H  2.606296 -0.727207 -1.736719
H  2.385194 -2.203248 -0.825542
H  0.300749 -1.404679 -1.928857
H  0.374907 0.0869 -1.016374
H  2.327863 -0.903996 1.301495
H  2.422158 0.591487 0.397637
H  0.077586 -1.188923 1.11427
H  0.134627 -2.695896 0.236398
H  4.668979 -0.067915 -0.465198
H  4.53665 -1.613923 0.341488
H  -2.175934 -2.128371 0.766099
H  -1.934351 -2.173519 -0.966978
H  4.498284 -0.476263 2.557474
H  5.966113 -0.189731 1.65554
H  3.654093 1.805735 1.939657
H  5.238081 1.91813 2.687157
H  5.079815 2.065437 0.940668
H  -3.449747 2.254064 -1.940265
H  -2.936815 3.02801 0.506225
elementType: S O N C H
totalener: -958.85580596 hartree
nucrepener: 1005.50123228 hartree
electener: -1964.35703823 hartree
oneelecener: -3305.41181231 hartree
twoeener: 1341.05477408 hartree
cpcmener: -0.02629905 hartree
kineticenergy: 955.51943425 hartree
xcener: -75.348031050831 hartree
chargesum: 0.0000000
charge: 0.120393 -0.589841 -0.075649 -0.141963 -0.114428 -0.113146 -0.124863 -0.122848 -0.095893 -0.106267 -0.279170 0.329379 -0.266878 -0.061560 0.072347 0.066704 0.082671 0.061427 0.060756 0.059978 0.073773 0.084436 0.063186 0.068246 0.131968 0.103184 0.053353 0.069490 0.078594 0.092219 0.080138 0.162172 0.178091
qa: 0.1204 -0.5898 -0.0756 -0.1420 -0.1144 -0.1131 -0.1249 -0.1228 -0.0959 -0.1063 -0.2792 0.3294 -0.2669 -0.0616 0.0723 0.0667 0.0827 0.0614 0.0608 0.0600 0.0738 0.0844 0.0632 0.0682 0.1320 0.1032 0.0534 0.0695 0.0786 0.0922 0.0801 0.1622 0.1781
va: 2.5626 1.9090 3.0781 3.9176 3.8528 3.8476 3.8426 3.8874 3.8265 3.8934 3.9271 4.1762 3.9204 3.9946 1.0093 1.0094 1.0193 1.0157 1.0076 1.0077 1.0059 1.0191 1.0086 1.0107 1.0013 1.0274 1.0092 1.0070 0.9985 1.0043 1.0004 0.9977 0.9836
dispcorr: -0.013016022 hartree
energy: -958.868821979309
dipole: 31.79642 -31.22253 0.57389 -3.82118 4.57124 0.75006 5.20115 -3.12560 2.07555
magnitude: 2.28032 au
magnitude: 5.79612 debye
