program: Orca
programVersion: 4.2.1
elementType: S O N C C C C C C C C C C C H H H H H H H H H H H H H H H H H H H
charge: 0
multiplicity: 1
keywords: wb97x-d3
keywords: def2-TZVPP
keywords: def2/J RIJCOSX GRIDX6 NOFINALGRIDX
keywords: grid4 nofinalgrid
keywords: scfconv7
keywords: smallprint printgap noloewdin
keywords: NOSOSCF
formula: C11H19NOS
InChI: InChI=1/C11H19NOS/c1-2-3-4-5-6-7-9-12-11(13)8-10-14-12/h8,10H,2-7,9H2,1H3
33 atoms
S  -1.521945 0.313768 1.210033
O  -1.805055 0.332608 -2.54194
N  -1.836442 -0.289381 -0.341896
C  1.303182 -1.283914 -0.138042
C  0.325106 -2.433996 0.090512
C  2.258271 -1.081135 1.030629
C  -0.812774 -2.504795 -0.929904
C  3.256283 0.055948 0.830437
C  -2.058897 -1.711328 -0.557848
C  2.618741 1.439428 0.754639
C  3.647478 2.55206 0.621013
C  -1.652509 0.614489 -1.354634
C  -1.273623 1.893052 -0.778283
C  -1.165113 1.854913 0.560358
H  0.761393 -0.355778 -0.328784
H  1.877354 -1.482684 -1.049491
H  -0.091521 -2.373315 1.102235
H  0.886256 -3.371466 0.065304
H  2.805067 -2.012062 1.210852
H  1.674779 -0.891311 1.938309
H  -1.146585 -3.538681 -1.043384
H  -0.45562 -2.192839 -1.914549
H  3.839533 -0.126076 -0.078905
H  3.974971 0.04627 1.655999
H  -2.50271 -2.118247 0.351601
H  -2.814008 -1.80892 -1.33775
H  1.92545 1.491116 -0.088734
H  2.012802 1.604845 1.651299
H  4.243835 2.432932 -0.285582
H  3.17245 3.53284 0.573427
H  4.336536 2.561298 1.467582
H  -1.094278 2.769213 -1.382049
H  -0.901649 2.66468 1.224477
elementType: S O N C H
totalener: -958.85394319 hartree
nucrepener: 1069.07527158 hartree
electener: -2027.92921476 hartree
oneelecener: -3432.49499468 hartree
twoeener: 1404.56577992 hartree
cpcmener: -0.02640293 hartree
kineticenergy: 955.52278180 hartree
xcener: -75.350997155378 hartree
chargesum: -0.0000000
charge: 0.119847 -0.586451 -0.064552 -0.105736 -0.168616 -0.110842 -0.106254 -0.130627 -0.099690 -0.065229 -0.291667 0.344630 -0.288650 -0.042396 0.011770 0.080452 0.071414 0.091122 0.076999 0.055494 0.090365 0.075232 0.058104 0.070792 0.118481 0.106392 0.047675 0.053044 0.079211 0.090770 0.081416 0.159093 0.178407
qa: 0.1198 -0.5865 -0.0646 -0.1057 -0.1686 -0.1108 -0.1063 -0.1306 -0.0997 -0.0652 -0.2917 0.3446 -0.2886 -0.0424 0.0118 0.0805 0.0714 0.0911 0.0770 0.0555 0.0904 0.0752 0.0581 0.0708 0.1185 0.1064 0.0477 0.0530 0.0792 0.0908 0.0814 0.1591 0.1784
va: 2.5575 1.9147 3.0743 3.8496 3.8752 3.8881 3.8165 3.9059 3.8897 3.8450 3.9609 4.1388 3.9133 3.9474 1.0213 1.0173 1.0049 1.0107 1.0117 1.0161 1.0136 1.0229 1.0086 1.0094 1.0009 1.0175 1.0068 1.0065 1.0001 1.0028 1.0006 1.0019 0.9827
dispcorr: -0.015992702 hartree
energy: -958.869935887672
dipole: 21.39453 -21.03778 0.35675 -3.05022 2.98285 -0.06737 3.53972 -1.25575 2.28397
magnitude: 2.31265 au
magnitude: 5.87828 debye
