program: Orca
programVersion: 4.2.1
elementType: S O N C C C C C C C C C C C H H H H H H H H H H H H H H H H H H H
charge: 0
multiplicity: 1
keywords: wb97x-d3
keywords: def2-TZVPP
keywords: def2/J RIJCOSX GRIDX6 NOFINALGRIDX
keywords: grid4 nofinalgrid
keywords: scfconv7
keywords: smallprint printgap noloewdin
keywords: NOSOSCF
formula: C11H19NOS
InChI: InChI=1/C11H19NOS/c1-2-3-4-5-6-7-9-12-11(13)8-10-14-12/h8,10H,2-7,9H2,1H3
33 atoms
S  -2.289503 -0.164312 -1.589002
O  -1.741377 0.946951 1.968341
N  -2.053539 -0.3202 0.082113
C  1.108106 -0.743702 -0.041767
C  0.621036 -2.08211 0.503749
C  2.601052 -0.528087 0.176044
C  -0.796654 -2.491951 0.116619
C  3.069962 0.832601 -0.326163
C  -1.929272 -1.641813 0.67661
C  4.568786 1.079357 -0.184086
C  5.052378 1.134203 1.258226
C  -1.928775 0.866131 0.755483
C  -2.054727 1.958744 -0.194466
C  -2.243981 1.541007 -1.45595
H  0.572527 0.079537 0.436059
H  0.885253 -0.676917 -1.112165
H  0.711276 -2.085038 1.594656
H  1.293974 -2.867394 0.145676
H  3.16349 -1.318443 -0.333486
H  2.824403 -0.633776 1.242319
H  -0.975121 -3.504751 0.485439
H  -0.880446 -2.561424 -0.972789
H  2.523741 1.619971 0.205076
H  2.792797 0.932171 -1.380482
H  -1.795786 -1.486706 1.746704
H  -2.877129 -2.168689 0.550483
H  5.117948 0.303105 -0.725635
H  4.816887 2.02339 -0.67653
H  4.512959 1.895798 1.825197
H  4.917529 0.183207 1.775097
H  6.113968 1.380129 1.308248
H  -1.992823 2.993357 0.105539
H  -2.364722 2.145884 -2.342356
elementType: S O N C H
totalener: -958.85400904 hartree
nucrepener: 1030.51909439 hartree
electener: -1989.37310344 hartree
oneelecener: -3355.71203130 hartree
twoeener: 1366.33892786 hartree
cpcmener: -0.02601661 hartree
kineticenergy: 955.52201900 hartree
xcener: -75.349248529266 hartree
chargesum: 0.0000000
charge: 0.116064 -0.587217 -0.050185 -0.109911 -0.098254 -0.129891 -0.150673 -0.105752 -0.094219 -0.115400 -0.278234 0.306232 -0.269211 -0.053849 0.046925 0.059437 0.067572 0.071841 0.060806 0.064120 0.093961 0.074490 0.059986 0.067605 0.100356 0.137595 0.054807 0.069679 0.080593 0.078852 0.091850 0.161676 0.178347
qa: 0.1161 -0.5872 -0.0502 -0.1099 -0.0983 -0.1299 -0.1507 -0.1058 -0.0942 -0.1154 -0.2782 0.3062 -0.2692 -0.0538 0.0469 0.0594 0.0676 0.0718 0.0608 0.0641 0.0940 0.0745 0.0600 0.0676 0.1004 0.1376 0.0548 0.0697 0.0806 0.0789 0.0919 0.1617 0.1783
va: 2.5614 1.9116 3.0810 3.8922 3.8567 3.9070 3.9037 3.8677 3.8280 3.9027 3.9253 4.1881 3.9195 3.9795 1.0149 1.0170 1.0096 1.0084 1.0109 1.0075 1.0138 1.0084 1.0089 1.0109 1.0288 0.9992 1.0081 1.0069 0.9998 0.9991 1.0043 0.9988 0.9829
dispcorr: -0.013938752 hartree
energy: -958.867947796538
dipole: 27.86926 -28.05844 -0.18918 -3.55747 2.85460 -0.70287 3.62673 -5.84487 -2.21814
magnitude: 2.33452 au
magnitude: 5.93387 debye
