program: Orca
programVersion: 4.2.1
elementType: S O N C C C C C C C C C C C H H H H H H H H H H H H H H H H H H H
charge: 0
multiplicity: 1
keywords: wb97x-d3
keywords: def2-TZVPP
keywords: def2/J RIJCOSX GRIDX6 NOFINALGRIDX
keywords: grid4 nofinalgrid
keywords: scfconv7
keywords: smallprint printgap noloewdin
keywords: NOSOSCF
formula: C11H19NOS
InChI: InChI=1/C11H19NOS/c1-2-3-4-5-6-7-9-12-11(13)8-10-14-12/h8,10H,2-7,9H2,1H3
33 atoms
S  -1.849656 0.655375 -1.634509
O  -2.120925 0.112909 2.084064
N  -2.013602 -0.210399 -0.184394
C  2.01826 -2.001226 -0.164775
C  0.634903 -1.567054 0.304348
C  3.157118 -1.5592 0.751794
C  -0.471153 -2.114919 -0.586037
C  3.233903 -0.057731 1.01987
C  -1.86793 -1.656705 -0.191731
C  3.36992 0.799893 -0.232179
C  3.517867 2.279318 0.090893
C  -2.05312 0.567868 0.944356
C  -2.009755 1.966649 0.54928
C  -1.895152 2.136863 -0.776891
H  2.18547 -1.623438 -1.178306
H  2.043321 -3.092076 -0.247585
H  0.583712 -0.473961 0.318429
H  0.471489 -1.894558 1.336632
H  4.104415 -1.891194 0.315591
H  3.066186 -2.082129 1.708731
H  -0.469653 -3.207472 -0.553895
H  -0.274391 -1.845205 -1.62881
H  4.090512 0.133539 1.673882
H  2.354568 0.267389 1.585361
H  -2.11542 -1.996279 0.812985
H  -2.613868 -2.084341 -0.863088
H  4.234198 0.461501 -0.81231
H  2.498647 0.660568 -0.878649
H  2.647557 2.653924 0.633331
H  4.395753 2.463372 0.713173
H  3.624006 2.880201 -0.813204
H  -2.055337 2.770149 1.268197
H  -1.84129 3.067893 -1.321592
elementType: S O N C H
totalener: -958.85575499 hartree
nucrepener: 1039.00829062 hartree
electener: -1997.86404560 hartree
oneelecener: -3372.56727591 hartree
twoeener: 1374.70323031 hartree
cpcmener: -0.02601864 hartree
kineticenergy: 955.51784323 hartree
xcener: -75.348314756866 hartree
chargesum: -0.0000000
charge: 0.121402 -0.584407 -0.080526 -0.131124 -0.101077 -0.165357 -0.131853 -0.128188 -0.083320 -0.087937 -0.280560 0.322971 -0.268553 -0.057075 0.070867 0.079469 0.039674 0.077909 0.075475 0.074181 0.085146 0.074754 0.078194 0.064079 0.103192 0.131910 0.063650 0.048847 0.077706 0.079045 0.091754 0.161238 0.178512
qa: 0.1214 -0.5844 -0.0805 -0.1311 -0.1011 -0.1654 -0.1319 -0.1282 -0.0833 -0.0879 -0.2806 0.3230 -0.2686 -0.0571 0.0709 0.0795 0.0397 0.0779 0.0755 0.0742 0.0851 0.0748 0.0782 0.0641 0.1032 0.1319 0.0637 0.0488 0.0777 0.0790 0.0918 0.1612 0.1785
va: 2.5573 1.9143 3.0844 3.8696 3.8091 3.9150 3.8610 3.8523 3.8193 3.8498 3.9447 4.1748 3.9216 3.9868 1.0003 1.0112 1.0140 1.0172 1.0085 1.0079 1.0211 1.0079 1.0091 1.0011 1.0275 1.0018 1.0078 1.0075 1.0012 1.0021 1.0028 0.9984 0.9829
dispcorr: -0.014012092 hartree
energy: -958.869767078604
dipole: 25.49233 -25.12012 0.37221 -4.59457 4.89282 0.29825 1.93716 -4.16609 -2.22893
magnitude: 2.27939 au
magnitude: 5.79376 debye
