program: Orca
programVersion: 4.2.1
elementType: S O N C C C C C C C C C C C H H H H H H H H H H H H H H H H H H H
charge: 0
multiplicity: 1
keywords: wb97x-d3
keywords: def2-TZVPP
keywords: def2/J RIJCOSX GRIDX6 NOFINALGRIDX
keywords: grid4 nofinalgrid
keywords: scfconv7
keywords: smallprint printgap noloewdin
keywords: NOSOSCF
formula: C11H19NOS
InChI: InChI=1/C11H19NOS/c1-2-3-4-5-6-7-9-12-11(13)8-10-14-12/h8,10H,2-7,9H2,1H3
33 atoms
S  -2.218724 0.469607 1.120667
O  -1.517878 0.424186 -2.581501
N  -1.984787 -0.196029 -0.42288
C  1.936265 -2.041752 0.42499
C  0.724932 -1.504183 -0.327718
C  3.272927 -1.489325 -0.064845
C  -0.569434 -2.160307 0.130684
C  3.394661 0.032677 -0.050331
C  -1.814689 -1.632071 -0.566844
C  3.174777 0.669558 1.31651
C  3.397725 2.174617 1.299797
C  -1.754021 0.724205 -1.413388
C  -1.847137 2.058397 -0.842282
C  -2.079052 2.051445 0.479504
H  1.95828 -3.132207 0.335467
H  1.813965 -1.834753 1.492756
H  0.854823 -1.66033 -1.404038
H  0.657754 -0.421486 -0.181828
H  3.451723 -1.84595 -1.083728
H  4.072524 -1.915991 0.548615
H  -0.676587 -2.0486 1.214549
H  -0.528412 -3.236324 -0.056961
H  2.694911 0.470779 -0.769291
H  4.392708 0.3025 -0.409632
H  -2.705667 -2.134887 -0.18785
H  -1.769779 -1.830533 -1.63668
H  2.15939 0.464288 1.66738
H  3.846809 0.20665 2.045819
H  3.236309 2.61542 2.284313
H  4.415042 2.422086 0.990904
H  2.715142 2.666928 0.604427
H  -1.727785 2.950135 -1.438065
H  -2.187333 2.902114 1.135841
elementType: S O N C H
totalener: -958.85585638 hartree
nucrepener: 1037.90037217 hartree
electener: -1996.75622856 hartree
oneelecener: -3370.32867492 hartree
twoeener: 1373.57244636 hartree
cpcmener: -0.02597364 hartree
kineticenergy: 955.51858485 hartree
xcener: -75.348476977099 hartree
chargesum: -0.0000000
charge: 0.120706 -0.584594 -0.081538 -0.128085 -0.101436 -0.165220 -0.131943 -0.128999 -0.085263 -0.086430 -0.281093 0.326740 -0.270103 -0.056851 0.079007 0.069832 0.077346 0.039713 0.074043 0.075801 0.075781 0.084767 0.064708 0.077423 0.132061 0.103028 0.048338 0.064169 0.091471 0.078875 0.077689 0.161736 0.178320
qa: 0.1207 -0.5846 -0.0815 -0.1281 -0.1014 -0.1652 -0.1319 -0.1290 -0.0853 -0.0864 -0.2811 0.3267 -0.2701 -0.0569 0.0790 0.0698 0.0773 0.0397 0.0740 0.0758 0.0758 0.0848 0.0647 0.0774 0.1321 0.1030 0.0483 0.0642 0.0915 0.0789 0.0777 0.1617 0.1783
va: 2.5570 1.9148 3.0848 3.8685 3.8069 3.9163 3.8597 3.8529 3.8195 3.8491 3.9455 4.1731 3.9219 3.9872 1.0112 1.0008 1.0175 1.0140 1.0081 1.0081 1.0074 1.0212 1.0009 1.0093 1.0017 1.0277 1.0080 1.0074 1.0031 1.0022 1.0008 0.9981 0.9829
dispcorr: -0.013958399 hartree
energy: -958.869814781514
dipole: 25.23940 -25.45854 -0.21914 -4.80438 4.80269 -0.00168 4.88294 -2.61479 2.26815
magnitude: 2.27872 au
magnitude: 5.79204 debye
