program: Orca
programVersion: 4.2.1
elementType: S O N C C C C C C C C C C C H H H H H H H H H H H H H H H H H H H
charge: 0
multiplicity: 1
keywords: wb97x-d3
keywords: def2-TZVPP
keywords: def2/J RIJCOSX GRIDX6 NOFINALGRIDX
keywords: grid4 nofinalgrid
keywords: scfconv7
keywords: smallprint printgap noloewdin
keywords: NOSOSCF
formula: C11H19NOS
InChI: InChI=1/C11H19NOS/c1-2-3-4-5-6-7-9-12-11(13)8-10-14-12/h8,10H,2-7,9H2,1H3
33 atoms
S  -0.988548 1.315985 0.152838
O  -3.782594 -0.911964 -1.025069
N  -1.905347 -0.099463 -0.001821
C  1.647288 -1.238815 0.121077
C  0.616306 -1.601223 -0.940717
C  2.923683 -0.664268 -0.481127
C  -0.662266 -2.226793 -0.394402
C  3.989655 -0.291651 0.544818
C  -1.454656 -1.358155 0.572674
C  3.608203 0.873838 1.450517
C  4.733025 1.272896 2.393838
C  -3.019805 0.023613 -0.78775
C  -3.120314 1.398491 -1.246001
C  -2.107642 2.170566 -0.819058
H  1.890228 -2.129293 0.711345
H  1.225252 -0.518734 0.828641
H  1.065927 -2.309873 -1.642154
H  0.377256 -0.714395 -1.536284
H  2.674225 0.220168 -1.078046
H  3.341716 -1.393029 -1.182444
H  -0.418713 -3.150543 0.138274
H  -1.311746 -2.515159 -1.224225
H  4.913527 -0.035986 0.016307
H  4.227059 -1.167398 1.158999
H  -0.877798 -1.134081 1.470285
H  -2.340891 -1.89358 0.912671
H  3.327508 1.732037 0.831772
H  2.721193 0.621814 2.03778
H  5.0169 0.444317 3.045756
H  5.625272 1.57565 1.842325
H  4.444092 2.107936 3.033517
H  -3.932179 1.741781 -1.868684
H  -1.944115 3.219547 -1.018259
elementType: S O N C H
totalener: -958.85559392 hartree
nucrepener: 1025.00149469 hartree
electener: -1983.85708861 hartree
oneelecener: -3344.17856804 hartree
twoeener: 1360.32147942 hartree
cpcmener: -0.02637934 hartree
kineticenergy: 955.52155193 hartree
xcener: -75.349474101277 hartree
chargesum: 0.0000000
charge: 0.110646 -0.594910 -0.046541 -0.121669 -0.162876 -0.111942 -0.109288 -0.131194 -0.128116 -0.072326 -0.289053 0.349207 -0.283635 -0.052756 0.075037 0.046780 0.083348 0.073594 0.057650 0.076228 0.080456 0.085536 0.071619 0.058897 0.125786 0.111726 0.054713 0.053448 0.078717 0.079878 0.090502 0.162226 0.178313
qa: 0.1106 -0.5949 -0.0465 -0.1217 -0.1629 -0.1119 -0.1093 -0.1312 -0.1281 -0.0723 -0.2891 0.3492 -0.2836 -0.0528 0.0750 0.0468 0.0833 0.0736 0.0576 0.0762 0.0805 0.0855 0.0716 0.0589 0.1258 0.1117 0.0547 0.0534 0.0787 0.0799 0.0905 0.1622 0.1783
va: 2.5689 1.9039 3.0588 3.8471 3.8911 3.8797 3.8305 3.8985 3.8761 3.8493 3.9543 4.1609 3.9364 3.9897 1.0147 0.9956 1.0150 1.0044 1.0132 1.0116 1.0160 1.0232 1.0087 1.0082 0.9912 1.0226 1.0068 1.0056 1.0001 1.0010 1.0031 0.9976 0.9830
dispcorr: -0.013682721 hartree
energy: -958.869276643876
dipole: 28.35727 -26.57404 1.78323 -5.11936 6.43549 1.31613 6.05962 -5.47538 0.58424
magnitude: 2.29204 au
magnitude: 5.82590 debye
