program: Orca
programVersion: 4.2.1
elementType: S O N C C C C C C C C C C C H H H H H H H H H H H H H H H H H H H
charge: 0
multiplicity: 1
keywords: wb97x-d3
keywords: def2-TZVPP
keywords: def2/J RIJCOSX GRIDX6 NOFINALGRIDX
keywords: grid4 nofinalgrid
keywords: scfconv7
keywords: smallprint printgap noloewdin
keywords: NOSOSCF
formula: C11H19NOS
InChI: InChI=1/C11H19NOS/c1-2-3-4-5-6-7-9-12-11(13)8-10-14-12/h8,10H,2-7,9H2,1H3
33 atoms
S  -2.88456 0.953313 1.013671
O  -2.878374 -0.260575 -2.550792
N  -2.238179 0.453365 -0.471139
C  2.039105 -0.491188 0.413051
C  1.067739 -1.472683 -0.233517
C  3.493072 -0.911917 0.242248
C  -0.405932 -1.152132 -0.008734
C  4.4834 0.062853 0.865289
C  -0.815284 0.191215 -0.596747
C  5.934682 -0.365474 0.689116
C  6.922874 0.60976 1.310172
C  -3.169627 0.162687 -1.433813
C  -4.492882 0.443928 -0.902201
C  -4.471223 0.856753 0.375073
H  1.807414 -0.399109 1.479835
H  1.909212 0.508015 -0.014132
H  1.261674 -2.474434 0.160085
H  1.266994 -1.52677 -1.308684
H  3.713992 -1.017261 -0.825495
H  3.636946 -1.905472 0.68043
H  -0.626607 -1.16748 1.063149
H  -1.017679 -1.934311 -0.465109
H  4.264799 0.17216 1.933164
H  4.342705 1.055918 0.424575
H  -0.578391 0.232058 -1.660064
H  -0.276582 1.015385 -0.1278
H  6.074625 -1.357335 1.129607
H  6.151857 -0.475238 -0.377781
H  6.834434 1.602432 0.864504
H  6.754074 0.716275 2.383445
H  7.95321 0.279283 1.171947
H  -5.389145 0.318262 -1.490231
H  -5.311062 1.124645 0.999128
elementType: S O N C H
totalener: -958.85728019 hartree
nucrepener: 962.84782818 hartree
electener: -1921.70510838 hartree
oneelecener: -3219.99596401 hartree
twoeener: 1298.29085564 hartree
cpcmener: -0.02604702 hartree
kineticenergy: 955.51738016 hartree
xcener: -75.345387572640 hartree
chargesum: -0.0000000
charge: 0.122561 -0.593626 -0.075825 -0.111367 -0.135399 -0.121073 -0.117971 -0.103651 -0.080338 -0.081257 -0.285566 0.341964 -0.276449 -0.066995 0.063418 0.060236 0.073806 0.072078 0.058767 0.059065 0.072008 0.090220 0.055973 0.055558 0.101666 0.123935 0.054763 0.055071 0.077928 0.078463 0.091135 0.162669 0.178235
qa: 0.1226 -0.5936 -0.0758 -0.1114 -0.1354 -0.1211 -0.1180 -0.1037 -0.0803 -0.0813 -0.2856 0.3420 -0.2764 -0.0670 0.0634 0.0602 0.0738 0.0721 0.0588 0.0591 0.0720 0.0902 0.0560 0.0556 0.1017 0.1239 0.0548 0.0551 0.0779 0.0785 0.0911 0.1627 0.1782
va: 2.5576 1.9046 3.1050 3.8722 3.9132 3.8905 3.8742 3.8736 3.7935 3.8737 3.9474 4.1698 3.9261 3.9927 1.0083 1.0126 1.0105 1.0075 1.0094 1.0108 1.0186 1.0185 1.0088 1.0092 1.0252 1.0011 1.0066 1.0065 1.0006 1.0001 1.0041 0.9973 0.9838
dispcorr: -0.011658964 hartree
energy: -958.868939156169
dipole: 40.12484 -40.13623 -0.01139 -5.15994 5.74165 0.58171 5.59499 -3.41968 2.17532
magnitude: 2.25178 au
magnitude: 5.72357 debye
