program: Orca
programVersion: 4.2.1
elementType: S O N C C C C C C C C C C C H H H H H H H H H H H H H H H H H H H
charge: 0
multiplicity: 1
keywords: wb97x-d3
keywords: def2-TZVPP
keywords: def2/J RIJCOSX GRIDX6 NOFINALGRIDX
keywords: grid4 nofinalgrid
keywords: scfconv7
keywords: smallprint printgap noloewdin
keywords: NOSOSCF
formula: C11H19NOS
InChI: InChI=1/C11H19NOS/c1-2-3-4-5-6-7-9-12-11(13)8-10-14-12/h8,10H,2-7,9H2,1H3
33 atoms
S  -1.375358 0.612265 1.152898
O  -2.088501 0.1030 -2.510297
N  -1.790788 -0.227384 -0.259581
C  1.980247 -2.089763 -0.26841
C  0.582972 -2.044154 -0.883787
C  2.287601 -0.940055 0.692493
C  -0.533066 -2.324866 0.121935
C  2.329127 0.432013 0.027381
C  -1.864132 -1.680368 -0.236315
C  2.522886 1.58844 1.003673
C  3.84231 1.551122 1.761708
C  -1.833565 0.546176 -1.392425
C  -1.542962 1.923395 -1.029459
C  -1.278105 2.079519 0.277378
H  2.724113 -2.087319 -1.070919
H  2.109638 -3.040561 0.258058
H  0.518004 -2.770771 -1.697209
H  0.436614 -1.069468 -1.355328
H  3.249314 -1.143915 1.171008
H  1.5513 -0.92015 1.503553
H  -0.24135 -1.998788 1.124572
H  -0.699313 -3.401118 0.205296
H  1.40023 0.606414 -0.523959
H  3.130443 0.448121 -0.720062
H  -2.639997 -1.986007 0.467415
H  -2.194912 -1.988542 -1.22725
H  2.455274 2.529609 0.451343
H  1.691753 1.597634 1.716083
H  3.961971 2.435869 2.388556
H  3.916171 0.681365 2.415749
H  4.691361 1.519086 1.075511
H  -1.536149 2.720984 -1.756375
H  -1.035776 2.99266 0.800562
elementType: S O N C H
totalener: -958.85305781 hartree
nucrepener: 1073.27798491 hartree
electener: -2032.13104272 hartree
oneelecener: -3440.85222225 hartree
twoeener: 1408.72117953 hartree
cpcmener: -0.02597883 hartree
kineticenergy: 955.51923481 hartree
xcener: -75.352053467988 hartree
chargesum: -0.0000000
charge: 0.116260 -0.586190 -0.058025 -0.145663 -0.159438 -0.135347 -0.142025 -0.126663 -0.083067 -0.108750 -0.278221 0.310658 -0.259270 -0.059740 0.073247 0.078548 0.095345 0.073993 0.084793 0.062435 0.079800 0.095541 0.052234 0.078398 0.132543 0.101449 0.073167 0.042433 0.092310 0.079928 0.081082 0.159985 0.178251
qa: 0.1163 -0.5862 -0.0580 -0.1457 -0.1594 -0.1353 -0.1420 -0.1267 -0.0831 -0.1088 -0.2782 0.3107 -0.2593 -0.0597 0.0732 0.0785 0.0953 0.0740 0.0848 0.0624 0.0798 0.0955 0.0522 0.0784 0.1325 0.1014 0.0732 0.0424 0.0923 0.0799 0.0811 0.1600 0.1783
va: 2.5528 1.9119 3.0873 3.9259 3.8660 3.8500 3.8599 3.8508 3.8276 3.8637 3.9447 4.1944 3.8947 3.9686 1.0083 1.0056 1.0092 1.0012 1.0106 1.0123 1.0028 1.0170 1.0175 1.0135 1.0002 1.0273 1.0057 1.0189 1.0041 0.9978 1.0002 1.0000 0.9831
dispcorr: -0.016389098 hartree
energy: -958.869446906380
dipole: 22.11274 -21.47851 0.63423 -4.73003 5.01722 0.28718 4.88808 -2.70951 2.17858
magnitude: 2.28712 au
magnitude: 5.81340 debye
