program: Orca
programVersion: 4.2.1
elementType: S O N C C C C C C C C C C C H H H H H H H H H H H H H H H H H H H
charge: 0
multiplicity: 1
keywords: wb97x-d3
keywords: def2-TZVPP
keywords: def2/J RIJCOSX GRIDX6 NOFINALGRIDX
keywords: grid4 nofinalgrid
keywords: scfconv7
keywords: smallprint printgap noloewdin
keywords: NOSOSCF
formula: C11H19NOS
InChI: InChI=1/C11H19NOS/c1-2-3-4-5-6-7-9-12-11(13)8-10-14-12/h8,10H,2-7,9H2,1H3
33 atoms
S  -1.625302 0.564465 1.216172
O  -2.112202 0.338296 -2.512804
N  -1.850825 -0.177196 -0.292939
C  2.202212 -1.971173 -0.536819
C  0.800945 -1.488669 -0.905672
C  2.634613 -1.667872 0.898521
C  -0.300819 -2.103075 -0.053861
C  2.512746 -0.204917 1.317072
C  -1.696977 -1.618377 -0.416007
C  3.317413 0.766316 0.462496
C  3.201311 2.202032 0.951598
C  -1.979112 0.693668 -1.343661
C  -1.939323 2.053927 -0.831402
C  -1.749941 2.112443 0.495957
H  2.916092 -1.526584 -1.235299
H  2.264392 -3.051769 -0.697834
H  0.611259 -1.725478 -1.956677
H  0.763428 -0.397076 -0.834628
H  3.673936 -1.988417 1.019849
H  2.055233 -2.280771 1.594962
H  -0.115941 -1.91929 1.008561
H  -0.298297 -3.190017 -0.172405
H  2.838039 -0.11308 2.358257
H  1.460125 0.098999 1.311107
H  -2.445059 -2.109868 0.208171
H  -1.934005 -1.863902 -1.450413
H  4.368784 0.462093 0.459447
H  2.984638 0.716337 -0.578061
H  3.557456 2.302495 1.978536
H  3.783508 2.886234 0.333115
H  2.164016 2.54237 0.930252
H  -2.044043 2.915153 -1.472812
H  -1.680638 2.993731 1.116095
elementType: S O N C H
totalener: -958.85483328 hartree
nucrepener: 1057.28648191 hartree
electener: -2016.14131519 hartree
oneelecener: -3408.92503107 hartree
twoeener: 1392.78371588 hartree
cpcmener: -0.02607485 hartree
kineticenergy: 955.52056749 hartree
xcener: -75.351652498496 hartree
chargesum: 0.0000000
charge: 0.116251 -0.587529 -0.069324 -0.174470 -0.095433 -0.155599 -0.145863 -0.099352 -0.090020 -0.096417 -0.276764 0.325877 -0.265947 -0.056237 0.082191 0.079499 0.086908 0.053834 0.077263 0.078136 0.077043 0.087064 0.079035 0.025800 0.133717 0.103010 0.062611 0.057425 0.079125 0.092285 0.073881 0.162491 0.179512
qa: 0.1163 -0.5875 -0.0693 -0.1745 -0.0954 -0.1556 -0.1459 -0.0994 -0.0900 -0.0964 -0.2768 0.3259 -0.2659 -0.0562 0.0822 0.0795 0.0869 0.0538 0.0773 0.0781 0.0770 0.0871 0.0790 0.0258 0.1337 0.1030 0.0626 0.0574 0.0791 0.0923 0.0739 0.1625 0.1795
va: 2.5484 1.9115 3.0828 3.9134 3.8064 3.8841 3.8505 3.8521 3.8227 3.8575 3.9465 4.1786 3.9103 3.9675 0.9996 1.0093 1.0168 1.0125 1.0088 1.0030 1.0018 1.0214 1.0123 1.0263 0.9997 1.0287 1.0082 1.0043 1.0017 1.0037 1.0003 0.9982 0.9818
dispcorr: -0.015193223 hartree
energy: -958.870026501468
dipole: 23.60391 -23.09335 0.51056 -5.02138 5.13048 0.10910 3.67941 -1.46679 2.21262
magnitude: 2.27338 au
magnitude: 5.77846 debye
