program: Orca
programVersion: 4.2.1
elementType: S O N C C C C C C C C C C C H H H H H H H H H H H H H H H H H H H
charge: 0
multiplicity: 1
keywords: wb97x-d3
keywords: def2-TZVPP
keywords: def2/J RIJCOSX GRIDX6 NOFINALGRIDX
keywords: grid4 nofinalgrid
keywords: scfconv7
keywords: smallprint printgap noloewdin
keywords: NOSOSCF
formula: C11H19NOS
InChI: InChI=1/C11H19NOS/c1-2-3-4-5-6-7-9-12-11(13)8-10-14-12/h8,10H,2-7,9H2,1H3
33 atoms
S  -0.894672 1.462802 -0.866747
O  -3.460035 -0.959128 0.454471
N  -1.72869 -0.004305 -0.708182
C  1.759262 -2.320046 0.76629
C  0.33268 -1.912027 0.402965
C  2.830634 -1.26665 0.485957
C  0.14584 -1.589189 -1.072702
C  2.60049 0.057501 1.206014
C  -1.27475 -1.178279 -1.433343
C  3.727706 1.069976 1.022237
C  3.893842 1.554921 -0.411281
C  -2.758288 0.012208 0.20117
C  -2.847152 1.348127 0.774561
C  -1.921445 2.192013 0.296048
H  2.017335 -3.238314 0.228978
H  1.785248 -2.577772 1.829816
H  0.031728 -1.056195 1.01419
H  -0.347237 -2.724479 0.677078
H  2.910868 -1.099812 -0.592109
H  3.80097 -1.671933 0.792078
H  0.391636 -2.465571 -1.679588
H  0.843071 -0.807449 -1.390128
H  2.467651 -0.139611 2.275277
H  1.664084 0.512729 0.866021
H  -1.977504 -1.975422 -1.192415
H  -1.357391 -0.992785 -2.506512
H  3.53474 1.931979 1.667087
H  4.669718 0.636562 1.373889
H  4.189358 0.752212 -1.088808
H  2.962975 1.980415 -0.794408
H  4.659061 2.330066 -0.480245
H  -3.589761 1.606717 1.514387
H  -1.772484 3.229819 0.557322
elementType: S O N C H
totalener: -958.86304532 hartree
nucrepener: 1046.22879385 hartree
electener: -2005.09183917 hartree
oneelecener: -3386.73646061 hartree
twoeener: 1381.64462144 hartree
cpcmener: -0.02060614 hartree
kineticenergy: 955.50821083 hartree
xcener: -75.346983385729 hartree
chargesum: -0.0000000
charge: 0.104845 -0.546187 -0.066780 -0.169310 -0.116147 -0.133671 -0.136369 -0.106776 -0.093154 -0.111534 -0.272185 0.309654 -0.264586 -0.057992 0.076209 0.076870 0.066594 0.087267 0.067107 0.078146 0.086007 0.071783 0.076505 0.036603 0.103507 0.130689 0.069330 0.055366 0.080083 0.072325 0.094285 0.158976 0.172542
qa: 0.1048 -0.5462 -0.0668 -0.1693 -0.1161 -0.1337 -0.1364 -0.1068 -0.0932 -0.1115 -0.2722 0.3097 -0.2646 -0.0580 0.0762 0.0769 0.0666 0.0873 0.0671 0.0781 0.0860 0.0718 0.0765 0.0366 0.1035 0.1307 0.0693 0.0554 0.0801 0.0723 0.0943 0.1590 0.1725
va: 2.5473 1.9685 3.0643 3.9293 3.8178 3.8435 3.8556 3.8555 3.8279 3.8969 3.9282 4.2132 3.9050 3.9715 1.0079 1.0073 1.0088 1.0157 1.0014 1.0110 1.0203 1.0015 1.0142 1.0266 1.0296 0.9998 1.0059 1.0098 0.9987 1.0028 1.0051 0.9990 0.9847
dispcorr: -0.014715767 hartree
energy: -958.877761089858
dipole: 25.45593 -23.90932 1.54661 -5.57543 6.87720 1.30177 2.94834 -3.53222 -0.58388
magnitude: 2.10417 au
magnitude: 5.34837 debye
