program: Orca
programVersion: 4.2.1
elementType: S O N C C C C C C C C C C C H H H H H H H H H H H H H H H H H H H
charge: 0
multiplicity: 1
keywords: wb97x-d3
keywords: def2-TZVPP
keywords: def2/J RIJCOSX GRIDX6 NOFINALGRIDX
keywords: grid4 nofinalgrid
keywords: scfconv7
keywords: smallprint printgap noloewdin
keywords: NOSOSCF
formula: C11H19NOS
InChI: InChI=1/C11H19NOS/c1-2-3-4-5-6-7-9-12-11(13)8-10-14-12/h8,10H,2-7,9H2,1H3
33 atoms
S  -0.957289 0.969783 0.835071
O  -3.1804 -0.199567 -1.963149
N  -1.760461 -0.125479 -0.173501
C  1.516784 -1.929605 0.49896
C  0.868821 -1.615624 -0.84619
C  3.017049 -1.64171 0.540432
C  -0.554137 -2.143785 -0.997082
C  3.409109 -0.176031 0.368788
C  -1.57845 -1.561508 -0.032484
C  2.970727 0.726114 1.515899
C  3.383519 2.176321 1.31661
C  -2.536456 0.449755 -1.147383
C  -2.447076 1.896637 -1.017728
C  -1.646626 2.287599 -0.013602
H  1.363969 -2.9904 0.723903
H  1.013868 -1.385566 1.305005
H  1.475451 -2.063769 -1.63965
H  0.88682 -0.538993 -1.039334
H  3.505513 -2.234666 -0.239638
H  3.422098 -2.00599 1.490262
H  -0.558345 -3.228271 -0.850811
H  -0.900401 -1.973977 -2.019313
H  3.010084 0.213466 -0.573742
H  4.498287 -0.116801 0.273524
H  -1.314923 -1.772211 1.004861
H  -2.549401 -2.029111 -0.198889
H  1.885081 0.679424 1.633564
H  3.393493 0.349085 2.452747
H  3.067459 2.802443 2.152679
H  4.467322 2.275034 1.225328
H  2.939601 2.593663 0.410173
H  -2.980875 2.567718 -1.673426
H  -1.410042 3.296568 0.291715
elementType: S O N C H
totalener: -958.86251428 hartree
nucrepener: 1049.69389295 hartree
electener: -2008.55640723 hartree
oneelecener: -3393.55038409 hartree
twoeener: 1384.99397686 hartree
cpcmener: -0.02051424 hartree
kineticenergy: 955.51383168 hartree
xcener: -75.347569900279 hartree
chargesum: 0.0000000
charge: 0.103078 -0.550959 -0.046332 -0.135276 -0.152886 -0.147496 -0.116553 -0.127361 -0.120223 -0.097257 -0.277701 0.325939 -0.275483 -0.057743 0.082916 0.058332 0.083218 0.071759 0.074398 0.074030 0.078499 0.087086 0.063336 0.077291 0.122238 0.112076 0.048806 0.063254 0.090711 0.081446 0.075509 0.158942 0.172403
qa: 0.1031 -0.5510 -0.0463 -0.1353 -0.1529 -0.1475 -0.1166 -0.1274 -0.1202 -0.0973 -0.2777 0.3259 -0.2755 -0.0577 0.0829 0.0583 0.0832 0.0718 0.0744 0.0740 0.0785 0.0871 0.0633 0.0773 0.1222 0.1121 0.0488 0.0633 0.0907 0.0814 0.0755 0.1589 0.1724
va: 2.5620 1.9624 3.0463 3.8503 3.8685 3.9219 3.8411 3.8546 3.8722 3.8625 3.9409 4.1995 3.9284 3.9846 1.0150 0.9965 1.0130 1.0031 1.0092 1.0088 1.0161 1.0245 1.0051 1.0092 0.9937 1.0222 1.0115 1.0119 1.0032 1.0026 1.0026 0.9988 0.9857
dispcorr: -0.014835375 hartree
energy: -958.877349651741
dipole: 23.95339 -22.59449 1.35890 -5.42849 6.05297 0.62448 4.38768 -2.91174 1.47593
magnitude: 2.10118 au
magnitude: 5.34077 debye
