program: Orca
programVersion: 4.2.1
elementType: S O N C C C C C C C C C C C H H H H H H H H H H H H H H H H H H H
charge: 0
multiplicity: 1
keywords: wb97x-d3
keywords: def2-TZVPP
keywords: def2/J RIJCOSX GRIDX6 NOFINALGRIDX
keywords: grid4 nofinalgrid
keywords: scfconv7
keywords: smallprint printgap noloewdin
keywords: NOSOSCF
formula: C11H19NOS
InChI: InChI=1/C11H19NOS/c1-2-3-4-5-6-7-9-12-11(13)8-10-14-12/h8,10H,2-7,9H2,1H3
33 atoms
S  -0.669964 1.062276 0.657599
O  -3.306725 -0.275003 -1.667133
N  -1.668768 -0.084297 -0.084501
C  1.575754 -2.023526 0.36345
C  0.740603 -1.806817 -0.895108
C  3.010825 -1.512545 0.23366
C  -0.706694 -2.273259 -0.776144
C  3.151908 0.009401 0.247134
C  -1.557687 -1.500404 0.224586
C  2.939691 0.637506 1.620215
C  2.985669 2.157626 1.584488
C  -2.524728 0.421431 -1.031171
C  -2.330975 1.861897 -1.108438
C  -1.381916 2.312238 -0.273076
H  1.595523 -3.094875 0.586147
H  1.09806 -1.555891 1.23058
H  1.20738 -2.353994 -1.719623
H  0.763152 -0.755108 -1.195366
H  3.440585 -1.909063 -0.691764
H  3.617503 -1.928463 1.044418
H  -0.733466 -3.325637 -0.477709
H  -1.188913 -2.222744 -1.755174
H  2.456013 0.45862 -0.469209
H  4.15203 0.278283 -0.106959
H  -1.168396 -1.599394 1.238661
H  -2.568033 -1.910033 0.247207
H  1.982036 0.318238 2.040222
H  3.705448 0.264741 2.307826
H  3.943405 2.519941 1.204474
H  2.206607 2.564521 0.935031
H  2.842535 2.588975 2.576559
H  -2.903858 2.483924 -1.779715
H  -1.045536 3.330293 -0.137939
elementType: S O N C H
totalener: -958.86201581 hartree
nucrepener: 1060.91800110 hartree
electener: -2019.78001692 hartree
oneelecener: -3415.95593085 hartree
twoeener: 1396.17591393 hartree
cpcmener: -0.02050416 hartree
kineticenergy: 955.50762780 hartree
xcener: -75.347041696710 hartree
chargesum: 0.0000000
charge: 0.094158 -0.549955 -0.040319 -0.131875 -0.166285 -0.131052 -0.104209 -0.127111 -0.127896 -0.131327 -0.262495 0.324766 -0.274714 -0.051797 0.082235 0.056421 0.083215 0.075324 0.072722 0.074562 0.076379 0.086700 0.054940 0.082547 0.122760 0.111630 0.061333 0.070986 0.085284 0.059121 0.093804 0.158230 0.171915
qa: 0.0942 -0.5500 -0.0403 -0.1319 -0.1663 -0.1311 -0.1042 -0.1271 -0.1279 -0.1313 -0.2625 0.3248 -0.2747 -0.0518 0.0822 0.0564 0.0832 0.0753 0.0727 0.0746 0.0764 0.0867 0.0549 0.0825 0.1228 0.1116 0.0613 0.0710 0.0853 0.0591 0.0938 0.1582 0.1719
va: 2.5761 1.9640 3.0472 3.8560 3.8907 3.9035 3.8283 3.8272 3.8770 3.8736 3.9249 4.1989 3.9337 3.9841 1.0147 1.0056 1.0141 1.0027 1.0087 1.0075 1.0174 1.0244 1.0156 1.0120 0.9930 1.0216 0.9966 1.0106 1.0025 1.0112 1.0037 0.9992 0.9860
dispcorr: -0.015456286 hartree
energy: -958.877472100165
dipole: 22.19001 -20.58243 1.60758 -5.68555 6.38078 0.69523 4.66764 -3.46037 1.20727
magnitude: 2.12724 au
magnitude: 5.40703 debye
